curl / Autobuilds / Log From 2018-07-09

Log from 2018-07-09

Jump down to problem:1 2 3 4 5 6 test results

testcurl: NAME = Steve Holme
testcurl: EMAIL = steve_holme /at/ hotmail.com
testcurl: DESC = Linux 3.16.0 x86_64 gcc 4.8 on Ubuntu 14.04.5 LTS
testcurl: NOTES =
testcurl: CONFOPTS = --disable-shared --enable-debug --enable-curldebug --enable-maintainer-mode --enable-warnings --enable-ldap --with-gssapi --with-libidn --with-libmetalink=/home/steve/Development/libs/libmetalink --with-librtmp --with-libssh2 --with-nghttp2=/home/steve/Development/libs/nghttp2
testcurl: RUNTESTOPTS =
testcurl: CPPFLAGS =
testcurl: CFLAGS =
testcurl: LDFLAGS =
testcurl: LIBS =
testcurl: CC =
testcurl: TMPDIR =
testcurl: MAKEFLAGS =
testcurl: ACLOCAL_FLAGS =
testcurl: PKG_CONFIG_PATH =
testcurl: DYLD_LIBRARY_PATH =
testcurl: LD_LIBRARY_PATH =
testcurl: LIBRARY_PATH =
testcurl: SHLIB_PATH =
testcurl: LIBPATH =
testcurl: target =
testcurl: version = 2014-11-25
testcurl: date = Mon Jul 9 13:30:03 2018 UTC
testcurl: curl is verified to be a fine git source dir
testcurl: build dir build-20009 was created fine
testcurl: run git pull in curl
From https://github.com/curl/curl
0b4ccc9..ba1dbd7 master -> origin/master
Merge made by the 'recursive' strategy.
lib/smtp.c | 3 ++-
1 file changed, 2 insertions(+), 1 deletion(-)
testcurl: The most recent curl git commits:
testcurl: 81a270a Merge branch 'master' of https://github.com/curl/curl
testcurl: ba1dbd7 smtp: use the upload buffer size for scratch buffer malloc
testcurl: 380dd34 Merge branch 'master' of https://github.com/curl/curl
testcurl: 0b4ccc9 scripts: include _curl as part of CLEANFILES
testcurl: fa254ae Merge branch 'master' of https://github.com/curl/curl
testcurl: invoke buildconf
buildconf: autoconf version 2.69 (ok)
buildconf: autom4te version 2.69 (ok)
buildconf: autoheader version 2.69 (ok)
buildconf: automake version 1.14.1 (ok)
buildconf: aclocal version 1.14.1 (ok)
buildconf: libtoolize version 2.4.2 (ok)
buildconf: GNU m4 version 1.4.17 (ok)
buildconf: running libtoolize
libtoolize: putting auxiliary files in `.'.
libtoolize: copying file `./ltmain.sh'
libtoolize: putting macros in AC_CONFIG_MACRO_DIR, `m4'.
libtoolize: copying file `m4/libtool.m4'
libtoolize: copying file `m4/ltoptions.m4'
libtoolize: copying file `m4/ltsugar.m4'
libtoolize: copying file `m4/ltversion.m4'
libtoolize: copying file `m4/lt~obsolete.m4'
libtoolize: Remember to add `LT_INIT' to configure.ac.
buildconf: converting all mv to mv -f in local m4/libtool.m4
buildconf: running aclocal
buildconf: converting all mv to mv -f in local aclocal.m4
buildconf: running autoheader
buildconf: running autoconf
buildconf: running automake
configure.ac:125: installing './compile'
configure.ac:187: installing './config.guess'
configure.ac:187: installing './config.sub'
configure.ac:125: installing './install-sh'
configure.ac:133: installing './missing'
docs/examples/Makefile.am: installing './depcomp'
buildconf: OK
testcurl: buildconf was successful
testcurl: timestamp = [unreleased] UTC
testcurl: configure created (at least it exists)
testcurl: going with make as make
checking whether to enable maintainer-specific portions of Makefiles... yes
checking whether make supports nested variables... yes
checking whether to enable debug build options... yes
checking whether to enable compiler optimizer... (assumed) no
checking whether to enable strict compiler warnings... yes
checking whether to enable compiler warnings as errors... no
checking whether to enable curl debug memory tracking... yes
checking whether to enable hiding of library internal symbols... yes
checking whether to enable c-ares for DNS lookups... no
checking whether to disable dependency on -lrt... (assumed no)
checking for path separator... :
checking for sed... /bin/sed
checking for grep... /bin/grep
checking for egrep... /bin/grep -E
checking for ar... /usr/bin/ar
checking for a BSD-compatible install... /usr/bin/install -c
checking for gcc... gcc
checking whether the C compiler works... yes
checking for C compiler default output file name... a.out
checking for suffix of executables...
checking whether we are cross compiling... no
checking for suffix of object files... o
checking whether we are using the GNU C compiler... yes
checking whether gcc accepts -g... yes
checking for gcc option to accept ISO C89... none needed
checking whether gcc understands -c and -o together... yes
checking how to run the C preprocessor... gcc -E
checking for a sed that does not truncate output... (cached) /bin/sed
checking whether to build with code coverage support... no
checking whether build environment is sane... yes
checking for a thread-safe mkdir -p... /bin/mkdir -p
checking for gawk... no
checking for mawk... mawk
checking whether make sets $(MAKE)... yes
checking for style of include used by make... GNU
checking dependency style of gcc... gcc3
checking curl version... 7.61.0-DEV
checking build system type... x86_64-unknown-linux-gnu
checking host system type... x86_64-unknown-linux-gnu
checking for grep that handles long lines and -e... (cached) /bin/grep
checking for egrep... /bin/grep -E
checking if OS is AIX (to define _ALL_SOURCE)... no
checking if _THREAD_SAFE is already defined... no
checking if _THREAD_SAFE is actually needed... no
checking if _THREAD_SAFE is onwards defined... no
checking if _REENTRANT is already defined... no
checking if _REENTRANT is actually needed... no
checking if _REENTRANT is onwards defined... no
checking for special C compiler options needed for large files... no
checking for _FILE_OFFSET_BITS value needed for large files... no
checking how to print strings... printf
checking for a sed that does not truncate output... (cached) /bin/sed
checking for fgrep... /bin/grep -F
checking for ld used by gcc... /usr/bin/ld
checking if the linker (/usr/bin/ld) is GNU ld... yes
checking for BSD- or MS-compatible name lister (nm)... /usr/bin/nm -B
checking the name lister (/usr/bin/nm -B) interface... BSD nm
checking whether ln -s works... yes
checking the maximum length of command line arguments... 1572864
checking whether the shell understands some XSI constructs... yes
checking whether the shell understands "+="... yes
checking how to convert x86_64-unknown-linux-gnu file names to x86_64-unknown-linux-gnu format... func_convert_file_noop
checking how to convert x86_64-unknown-linux-gnu file names to toolchain format... func_convert_file_noop
checking for /usr/bin/ld option to reload object files... -r
checking for objdump... objdump
checking how to recognize dependent libraries... pass_all
checking for dlltool... no
checking how to associate runtime and link libraries... printf %s\n
checking for archiver @FILE support... @
checking for strip... strip
checking for ranlib... ranlib
checking command to parse /usr/bin/nm -B output from gcc object... ok
checking for sysroot... no
checking for mt... mt
checking if mt is a manifest tool... no
checking for ANSI C header files... yes
checking for sys/types.h... yes
checking for sys/stat.h... yes
checking for stdlib.h... yes
checking for string.h... yes
checking for memory.h... yes
checking for strings.h... yes
checking for inttypes.h... yes
checking for stdint.h... yes
checking for unistd.h... yes
checking for dlfcn.h... yes
checking for objdir... .libs
checking if gcc supports -fno-rtti -fno-exceptions... no
checking for gcc option to produce PIC... -fPIC -DPIC
checking if gcc PIC flag -fPIC -DPIC works... yes
checking if gcc static flag -static works... yes
checking if gcc supports -c -o file.o... yes
checking if gcc supports -c -o file.o... (cached) yes
checking whether the gcc linker (/usr/bin/ld -m elf_x86_64) supports shared libraries... yes
checking dynamic linker characteristics... GNU/Linux ld.so
checking how to hardcode library paths into programs... immediate
checking whether stripping libraries is possible... yes
checking if libtool supports shared libraries... yes
checking whether to build shared libraries... no
checking whether to build static libraries... yes
checking whether to build shared libraries with -version-info... yes
checking whether to build shared libraries with -no-undefined... no
checking whether to build shared libraries with -mimpure-text... no
checking whether to build shared libraries with PIC... yes
checking whether to build static libraries with PIC... yes
checking whether to build shared libraries only... no
checking whether to build static libraries only... yes
checking for inline... inline
checking if cpp -P is needed... no
checking if compiler is DEC/Compaq/HP C... no
checking if compiler is HP-UX C... no
checking if compiler is IBM C... no
checking if compiler is Intel C... no
checking if compiler is clang... no
checking if compiler is GNU C... yes
checking if compiler is LCC... no
checking if compiler is SGI MIPSpro C... no
checking if compiler is SGI MIPS C... no
checking if compiler is SunPro C... no
checking if compiler is Tiny C... no
checking if compiler is Watcom C... no
checking if compiler accepts some basic options... yes
configure: compiler options added: -Werror-implicit-function-declaration
checking if compiler accepts debug enabling options... yes
configure: compiler options added: -g
checking if compiler optimizer assumed setting might be used... yes
checking if compiler accepts optimizer disabling options... yes
configure: compiler options added: -O0
checking if compiler accepts strict warning options... yes
configure: compiler options added: -pedantic -Wall -W -Wpointer-arith -Wwrite-strings -Wunused -Wshadow -Winline -Wnested-externs -Wmissing-declarations -Wmissing-prototypes -Wno-long-long -Wfloat-equal -Wno-multichar -Wsign-compare -Wundef -Wno-format-nonliteral -Wendif-labels -Wstrict-prototypes -Wdeclaration-after-statement -Wstrict-aliasing=3 -Wcast-align -Wtype-limits -Wold-style-declaration -Wmissing-parameter-type -Wempty-body -Wclobbered -Wignored-qualifiers -Wconversion -Wno-sign-conversion -Wvla -Wdouble-promotion -Wno-system-headers
checking if compiler halts on compilation errors... yes
checking if compiler halts on negative sized arrays... yes
checking if compiler halts on function prototype mismatch... yes
checking if compiler supports hiding library internal symbols... yes
checking if curl debug memory tracking can be enabled... yes
checking for windows.h... no
checking whether build target is a native Windows one... no
checking whether build target supports WIN32 file API... no
checking for good-to-use Mac CFLAGS... no
checking to see if the compiler supports __builtin_available()... no
checking whether to support http... yes
checking whether to support ftp... yes
checking whether to support file... yes
checking whether to support ldap... yes
checking whether to support ldaps... yes
checking whether to support rtsp... yes
checking whether to support proxies... yes
checking whether to support dict... yes
checking whether to support telnet... yes
checking whether to support tftp... yes
checking whether to support pop3... yes
checking whether to support imap... yes
checking whether to support smb... yes
checking whether to support smtp... yes
checking whether to support gopher... yes
checking whether to provide built-in manual... yes
checking whether to enable generation of C code... yes
checking whether to use libgcc... no
checking if X/Open network library is required... no
checking for gethostbyname... yes
checking for windows.h... (cached) no
checking for winsock.h... (cached) no
checking for winsock2.h... (cached) no
checking for connect in libraries... yes
checking whether time.h and sys/time.h may both be included... yes
checking for sys/types.h... (cached) yes
checking sys/time.h usability... yes
checking sys/time.h presence... yes
checking for sys/time.h... yes
checking time.h usability... yes
checking time.h presence... yes
checking for time.h... yes
checking for monotonic clock_gettime... yes
checking for clock_gettime in libraries... no additional lib required
checking if monotonic clock_gettime works... yes
checking for pkg-config... /usr/bin/pkg-config
checking for zlib options with pkg-config... found
checking zlib.h usability... yes
checking zlib.h presence... yes
checking for zlib.h... yes
configure: found both libz and libz.h header
checking for BrotliDecoderDecompress in -lbrotlidec... no
checking brotli/decode.h usability... no
checking brotli/decode.h presence... no
checking for brotli/decode.h... no
checking for lber.h... yes
checking for ldap.h... yes
checking for ldapssl.h... no
checking for ldap_ssl.h... no
checking for LDAP libraries... -lldap -llber
checking for ldap_url_parse... yes
checking for ldap_init_fd... yes
checking whether to enable IPv6... yes
checking if struct sockaddr_in6 has sin6_scope_id member... yes
checking if argv can be written to... no
checking if GSS-API support is requested... yes
checking gss.h usability... no
checking gss.h presence... no
checking for gss.h... no
checking gssapi/gssapi.h usability... yes
checking gssapi/gssapi.h presence... yes
checking for gssapi/gssapi.h... yes
checking for gssapi/gssapi_generic.h... yes
checking for gssapi/gssapi_krb5.h... yes
checking if GSS-API headers declare GSS_C_NT_HOSTBASED_SERVICE... yes
checking whether to enable Windows native SSL/TLS (Windows native builds only)... no
checking whether to enable Apple OS native SSL/TLS... no
checking for pkg-config... (cached) /usr/bin/pkg-config
checking for openssl options with pkg-config... found
configure: pkg-config: SSL_LIBS: "-lssl -lcrypto "
configure: pkg-config: SSL_LDFLAGS: " "
configure: pkg-config: SSL_CPPFLAGS: " "
checking for HMAC_Update in -lcrypto... yes
checking for SSL_connect in -lssl... yes
checking openssl/x509.h usability... yes
checking openssl/x509.h presence... yes
checking for openssl/x509.h... yes
checking openssl/rsa.h usability... yes
checking openssl/rsa.h presence... yes
checking for openssl/rsa.h... yes
checking openssl/crypto.h usability... yes
checking openssl/crypto.h presence... yes
checking for openssl/crypto.h... yes
checking openssl/pem.h usability... yes
checking openssl/pem.h presence... yes
checking for openssl/pem.h... yes
checking openssl/ssl.h usability... yes
checking openssl/ssl.h presence... yes
checking for openssl/ssl.h... yes
checking openssl/err.h usability... yes
checking openssl/err.h presence... yes
checking for openssl/err.h... yes
checking for RAND_egd... yes
checking for ENGINE_cleanup... yes
checking for SSL_get_shutdown... yes
checking for SSLv2_client_method... no
checking for BoringSSL... no
checking for libressl... no
checking for OpenSSL headers version... 1.0.1 - 0x1000106fL
checking for OpenSSL library version... 1.0.1
checking for OpenSSL headers and library versions matching... yes
checking for "/dev/urandom"... yes
checking for SRP_Calc_client_key in -lcrypto... yes
checking for ssl_version in -laxtls... no
configure: built with one SSL backend
checking default CA cert bundle/path... /etc/ssl/certs/ca-certificates.crt
checking whether to use builtin CA store of SSL library... no
checking for library containing psl_builtin... no
configure: WARNING: libpsl was not found
configure: PKG_CONFIG_LIBDIR will be set to "/home/steve/Development/libs/libmetalink/lib/pkgconfig"
checking for pkg-config... (cached) /usr/bin/pkg-config
checking for libmetalink options with pkg-config... found
checking if libmetalink is recent enough... yes (0.1.3)
checking for pkg-config... (cached) /usr/bin/pkg-config
checking for libssh2 options with pkg-config... found
checking for libssh2_channel_open_ex in -lssh2... yes
checking libssh2.h usability... yes
checking libssh2.h presence... yes
checking for libssh2.h... yes
checking for pkg-config... (cached) /usr/bin/pkg-config
checking for librtmp options with pkg-config... found
checking for RTMP_Init in -lrtmp... yes
checking librtmp/rtmp.h usability... yes
checking librtmp/rtmp.h presence... yes
checking for librtmp/rtmp.h... yes
checking whether versioned symbols are wanted... no
checking whether to enable Windows native IDN (Windows native builds only)... no
checking whether to build with libidn2... (assumed) yes
checking for pkg-config... (cached) /usr/bin/pkg-config
checking for libidn2 options with pkg-config... no
configure: IDN_LIBS: "-lidn2"
configure: IDN_LDFLAGS: ""
configure: IDN_CPPFLAGS: ""
configure: IDN_DIR: ""
checking if idn2_lookup_ul can be linked... no
checking idn2.h usability... no
checking idn2.h presence... no
checking for idn2.h... no
configure: WARNING: Cannot find libraries for IDN support: IDN disabled
checking for pkg-config... (cached) /usr/bin/pkg-config
checking for libnghttp2 options with pkg-config... found
configure: -l is -lnghttp2
configure: -I is -I/home/steve/Development/libs/nghttp2/include
configure: -L is -L/home/steve/Development/libs/nghttp2/lib
checking for nghttp2_option_set_no_recv_client_magic in -lnghttp2... yes
checking nghttp2/nghttp2.h usability... yes
checking nghttp2/nghttp2.h presence... yes
checking for nghttp2/nghttp2.h... yes
checking for ANSI C header files... (cached) yes
checking for malloc.h... yes
checking for memory.h... no
checking for sys/types.h... (cached) yes
checking for sys/time.h... (cached) yes
checking for sys/select.h... yes
checking for sys/socket.h... yes
checking for sys/ioctl.h... yes
checking for sys/uio.h... yes
checking for assert.h... yes
checking for unistd.h... (cached) yes
checking for stdlib.h... (cached) yes
checking for arpa/inet.h... yes
checking for net/if.h... yes
checking for netinet/in.h... yes
checking for netinet/in6.h... no
checking for sys/un.h... yes
checking for linux/tcp.h... yes
checking for netinet/tcp.h... yes
checking for netdb.h... yes
checking for sys/sockio.h... no
checking for sys/stat.h... (cached) yes
checking for sys/param.h... yes
checking for termios.h... yes
checking for termio.h... yes
checking for sgtty.h... yes
checking for fcntl.h... yes
checking for alloca.h... yes
checking for time.h... (cached) yes
checking for io.h... no
checking for pwd.h... yes
checking for utime.h... yes
checking for sys/utime.h... no
checking for sys/poll.h... yes
checking for poll.h... yes
checking for socket.h... no
checking for sys/resource.h... yes
checking for libgen.h... yes
checking for locale.h... yes
checking for errno.h... yes
checking for stdbool.h... yes
checking for arpa/tftp.h... yes
checking for sys/filio.h... no
checking for sys/wait.h... yes
checking for setjmp.h... yes
checking for an ANSI C-conforming const... yes
checking for compiler support of C99 variadic macro style... yes
checking for compiler support of old gcc variadic macro style... yes
checking for size_t... yes
checking whether time.h and sys/time.h may both be included... (cached) yes
checking for sys/types.h... (cached) yes
checking for sys/time.h... (cached) yes
checking for time.h... (cached) yes
checking for sys/socket.h... (cached) yes
checking for struct timeval... yes
checking run-time libs availability... fine
checking size of size_t... 8
checking size of long... 8
checking size of int... 4
checking size of short... 2
checking size of time_t... 8
checking size of off_t... 8
checking size of curl_off_t... 8
checking for long long... yes
checking if numberLL works... yes
checking for ssize_t... yes
checking for bool... yes
checking for sa_family_t... yes
checking if time_t is unsigned... no
checking for windows.h... (cached) no
checking for winsock2.h... (cached) no
checking for ws2tcpip.h... (cached) no
checking for sys/types.h... (cached) yes
checking for sys/socket.h... (cached) yes
checking for curl_socklen_t data type... socklen_t
checking size of curl_socklen_t... 4
checking for sys/types.h... (cached) yes
checking for poll.h... (cached) yes
checking for sys/poll.h... (cached) yes
checking for in_addr_t... yes
checking for struct sockaddr_storage... yes
checking signal.h usability... yes
checking signal.h presence... yes
checking for signal.h... yes
checking for sig_atomic_t... yes
checking if sig_atomic_t is already defined as volatile... no
checking return type of signal handlers... void
checking for sys/select.h... (cached) yes
checking for sys/socket.h... (cached) yes
checking for select... yes
checking types of args and return type for select... int,fd_set *,struct timeval *,int
checking for sys/types.h... (cached) yes
checking for sys/socket.h... (cached) yes
checking for recv... yes
checking types of args and return type for recv... int,void *,size_t,int,ssize_t
checking for sys/types.h... (cached) yes
checking for sys/socket.h... (cached) yes
checking for send... yes
checking types of args and return type for send... int,const void *,size_t,int,ssize_t
checking for sys/types.h... (cached) yes
checking for sys/socket.h... (cached) yes
checking for MSG_NOSIGNAL... yes
checking for sys/types.h... (cached) yes
checking for unistd.h... (cached) yes
checking if alarm can be linked... yes
checking if alarm is prototyped... yes
checking if alarm is compilable... yes
checking if alarm usage allowed... yes
checking if alarm might be used... yes
checking for sys/types.h... (cached) yes
checking for string.h... (cached) yes
checking for strings.h... (cached) yes
checking for sys/types.h... (cached) yes
checking for libgen.h... (cached) yes
checking if basename can be linked... yes
checking if basename is prototyped... yes
checking if basename is compilable... yes
checking if basename usage allowed... yes
checking if basename might be used... yes
checking for sys/types.h... (cached) yes
checking for socket.h... (cached) no
checking if closesocket can be linked... no
checking if closesocket might be used... no
checking if CloseSocket can be linked... no
checking if CloseSocket might be used... no
checking if connect can be linked... yes
checking if connect is prototyped... yes
checking if connect is compilable... yes
checking if connect usage allowed... yes
checking if connect might be used... yes
checking for sys/types.h... (cached) yes
checking for unistd.h... (cached) yes
checking for fcntl.h... (cached) yes
checking if fcntl can be linked... yes
checking if fcntl is prototyped... yes
checking if fcntl is compilable... yes
checking if fcntl usage allowed... yes
checking if fcntl might be used... yes
checking if fcntl O_NONBLOCK is compilable... yes
checking if fcntl O_NONBLOCK usage allowed... yes
checking if fcntl O_NONBLOCK might be used... yes
checking for sys/types.h... (cached) yes
checking for stdio.h... yes
checking if fdopen can be linked... yes
checking if fdopen is prototyped... yes
checking if fdopen is compilable... yes
checking if fdopen usage allowed... yes
checking if fdopen might be used... yes
checking for sys/types.h... (cached) yes
checking for netdb.h... (cached) yes
checking if freeaddrinfo can be linked... yes
checking if freeaddrinfo is prototyped... yes
checking if freeaddrinfo is compilable... yes
checking if freeaddrinfo usage allowed... yes
checking if freeaddrinfo might be used... yes
checking for sys/types.h... (cached) yes
checking for sys/socket.h... (cached) yes
checking for netinet/in.h... (cached) yes
checking for ifaddrs.h... yes
checking if freeifaddrs can be linked... yes
checking if freeifaddrs is prototyped... yes
checking if freeifaddrs is compilable... yes
checking if freeifaddrs usage allowed... yes
checking if freeifaddrs might be used... yes
checking for sys/types.h... (cached) yes
checking for sys/xattr.h... yes
checking if fsetxattr can be linked... yes
checking if fsetxattr is prototyped... yes
checking if fsetxattr takes 5 args.... yes
checking if fsetxattr is compilable... yes
checking if fsetxattr usage allowed... yes
checking if fsetxattr might be used... yes
checking if ftruncate can be linked... yes
checking if ftruncate is prototyped... yes
checking if ftruncate is compilable... yes
checking if ftruncate usage allowed... yes
checking if ftruncate might be used... yes
checking for sys/types.h... (cached) yes
checking for stdlib.h... (cached) yes
checking if getaddrinfo can be linked... yes
checking if getaddrinfo is prototyped... yes
checking if getaddrinfo is compilable... yes
checking if getaddrinfo seems to work... yes
checking if getaddrinfo usage allowed... yes
checking if getaddrinfo might be used... yes
checking if getaddrinfo is threadsafe... yes
checking if gai_strerror can be linked... yes
checking if gai_strerror is prototyped... yes
checking if gai_strerror is compilable... yes
checking if gai_strerror usage allowed... yes
checking if gai_strerror might be used... yes
checking if gethostbyaddr can be linked... yes
checking if gethostbyaddr is prototyped... yes
checking if gethostbyaddr is compilable... yes
checking if gethostbyaddr usage allowed... yes
checking if gethostbyaddr might be used... yes
checking if gethostbyaddr_r can be linked... yes
checking if gethostbyaddr_r is prototyped... yes
checking if gethostbyaddr_r takes 5 args.... no
checking if gethostbyaddr_r takes 7 args.... no
checking if gethostbyaddr_r takes 8 args.... yes
checking if gethostbyaddr_r is compilable... yes
checking if gethostbyaddr_r usage allowed... yes
checking if gethostbyaddr_r might be used... yes
checking if gethostbyname can be linked... yes
checking if gethostbyname is prototyped... yes
checking if gethostbyname is compilable... yes
checking if gethostbyname usage allowed... yes
checking if gethostbyname might be used... yes
checking if gethostbyname_r can be linked... yes
checking if gethostbyname_r is prototyped... yes
checking if gethostbyname_r takes 3 args.... no
checking if gethostbyname_r takes 5 args.... no
checking if gethostbyname_r takes 6 args.... yes
checking if gethostbyname_r is compilable... yes
checking if gethostbyname_r usage allowed... yes
checking if gethostbyname_r might be used... yes
checking if gethostname can be linked... yes
checking if gethostname is prototyped... yes
checking if gethostname is compilable... yes
checking for gethostname arg 2 data type... size_t
checking if gethostname usage allowed... yes
checking if gethostname might be used... yes
checking if getifaddrs can be linked... yes
checking if getifaddrs is prototyped... yes
checking if getifaddrs is compilable... yes
checking if getifaddrs seems to work... yes
checking if getifaddrs usage allowed... yes
checking if getifaddrs might be used... yes
checking if getservbyport_r can be linked... yes
checking if getservbyport_r is prototyped... yes
checking if getservbyport_r takes 4 args.... no
checking if getservbyport_r takes 5 args.... no
checking if getservbyport_r takes 6 args.... yes
checking if getservbyport_r is compilable... yes
checking if getservbyport_r usage allowed... yes
checking if getservbyport_r might be used... yes
checking for sys/types.h... (cached) yes
checking for sys/time.h... (cached) yes
checking for time.h... (cached) yes
checking if gmtime_r can be linked... yes
checking if gmtime_r is prototyped... yes
checking if gmtime_r is compilable... yes
checking if gmtime_r seems to work... yes
checking if gmtime_r usage allowed... yes
checking if gmtime_r might be used... yes
checking for sys/types.h... (cached) yes
checking for sys/socket.h... (cached) yes
checking for netinet/in.h... (cached) yes
checking for arpa/inet.h... (cached) yes
checking if inet_ntoa_r can be linked... no
checking if inet_ntoa_r might be used... no
checking if inet_ntop can be linked... yes
checking if inet_ntop is prototyped... yes
checking if inet_ntop is compilable... yes
checking if inet_ntop seems to work... yes
checking if inet_ntop usage allowed... yes
checking if inet_ntop might be used... yes
checking if inet_pton can be linked... yes
checking if inet_pton is prototyped... yes
checking if inet_pton is compilable... yes
checking if inet_pton seems to work... yes
checking if inet_pton usage allowed... yes
checking if inet_pton might be used... yes
checking for sys/types.h... (cached) yes
checking for unistd.h... (cached) yes
checking for sys/socket.h... (cached) yes
checking for sys/ioctl.h... (cached) yes
checking for stropts.h... yes
checking if ioctl can be linked... yes
checking if ioctl is prototyped... yes
checking if ioctl is compilable... yes
checking if ioctl usage allowed... yes
checking if ioctl might be used... yes
checking if ioctl FIONBIO is compilable... yes
checking if ioctl FIONBIO usage allowed... yes
checking if ioctl FIONBIO might be used... yes
checking if ioctl SIOCGIFADDR is compilable... yes
checking if ioctl SIOCGIFADDR usage allowed... yes
checking if ioctl SIOCGIFADDR might be used... yes
checking if ioctlsocket can be linked... no
checking if ioctlsocket might be used... no
checking if IoctlSocket can be linked... no
checking if IoctlSocket might be used... no
checking if localtime_r can be linked... yes
checking if localtime_r is prototyped... yes
checking if localtime_r is compilable... yes
checking if localtime_r seems to work... yes
checking if localtime_r usage allowed... yes
checking if localtime_r might be used... yes
checking if memrchr can be linked... yes
checking if memrchr is prototyped... no
checking if memrchr might be used... no
checking if poll can be linked... yes
checking if poll is prototyped... yes
checking if poll is compilable... yes
checking if poll seems to work... yes
checking if poll usage allowed... yes
checking if poll might be used... yes
checking if setsockopt can be linked... yes
checking if setsockopt is prototyped... yes
checking if setsockopt is compilable... yes
checking if setsockopt usage allowed... yes
checking if setsockopt might be used... yes
checking if setsockopt SO_NONBLOCK is compilable... no
checking if setsockopt SO_NONBLOCK might be used... no
checking for sys/types.h... (cached) yes
checking for signal.h... (cached) yes
checking if sigaction can be linked... yes
checking if sigaction is prototyped... yes
checking if sigaction is compilable... yes
checking if sigaction usage allowed... yes
checking if sigaction might be used... yes
checking if siginterrupt can be linked... yes
checking if siginterrupt is prototyped... yes
checking if siginterrupt is compilable... yes
checking if siginterrupt usage allowed... yes
checking if siginterrupt might be used... yes
checking if signal can be linked... yes
checking if signal is prototyped... yes
checking if signal is compilable... yes
checking if signal usage allowed... yes
checking if signal might be used... yes
checking for sys/types.h... (cached) yes
checking for setjmp.h... (cached) yes
checking if sigsetjmp can be linked... no
checking if sigsetjmp seems a macro... yes
checking if sigsetjmp is compilable... yes
checking if sigsetjmp usage allowed... yes
checking if sigsetjmp might be used... yes
checking if socket can be linked... yes
checking if socket is prototyped... yes
checking if socket is compilable... yes
checking if socket usage allowed... yes
checking if socket might be used... yes
checking if socketpair can be linked... yes
checking if socketpair is prototyped... yes
checking if socketpair is compilable... yes
checking if socketpair usage allowed... yes
checking if socketpair might be used... yes
checking if strcasecmp can be linked... yes
checking if strcasecmp is prototyped... yes
checking if strcasecmp is compilable... yes
checking if strcasecmp usage allowed... yes
checking if strcasecmp might be used... yes
checking if strcmpi can be linked... no
checking if strcmpi might be used... no
checking if strdup can be linked... yes
checking if strdup is prototyped... yes
checking if strdup is compilable... yes
checking if strdup usage allowed... yes
checking if strdup might be used... yes
checking if strerror_r can be linked... yes
checking if strerror_r is prototyped... yes
checking if strerror_r is compilable... yes
checking if strerror_r is glibc like... no
checking if strerror_r is POSIX like... yes
checking if strerror_r seems to work... yes
checking if strerror_r usage allowed... yes
checking if strerror_r might be used... yes
checking if stricmp can be linked... no
checking if stricmp might be used... no
checking if strncasecmp can be linked... yes
checking if strncasecmp is prototyped... yes
checking if strncasecmp is compilable... yes
checking if strncasecmp usage allowed... yes
checking if strncasecmp might be used... yes
checking if strncmpi can be linked... no
checking if strncmpi might be used... no
checking if strnicmp can be linked... no
checking if strnicmp might be used... no
checking if strstr can be linked... yes
checking if strstr is prototyped... yes
checking if strstr is compilable... yes
checking if strstr usage allowed... yes
checking if strstr might be used... yes
checking if strtok_r can be linked... yes
checking if strtok_r is prototyped... yes
checking if strtok_r is compilable... yes
checking if strtok_r usage allowed... yes
checking if strtok_r might be used... yes
checking if strtoll can be linked... yes
checking if strtoll is prototyped... yes
checking if strtoll is compilable... yes
checking if strtoll usage allowed... yes
checking if strtoll might be used... yes
checking for sys/types.h... (cached) yes
checking for sys/uio.h... (cached) yes
checking if writev can be linked... yes
checking if writev is prototyped... yes
checking if writev is compilable... yes
checking if writev usage allowed... yes
checking if writev might be used... yes
checking whether getpwuid_r is declared... yes
checking for fnmatch... yes
checking for geteuid... yes
checking for getpass_r... no
checking deeper for getpass_r... but still no
checking for getppid... yes
checking for getpwuid... yes
checking for getpwuid_r... yes
checking for getrlimit... yes
checking for gettimeofday... yes
checking for if_nametoindex... yes
checking for mach_absolute_time... no
checking deeper for mach_absolute_time... but still no
checking for pipe... yes
checking for setlocale... yes
checking for setmode... no
checking deeper for setmode... but still no
checking for setrlimit... yes
checking for utime... yes
checking for utimes... yes
checking how to set a socket into non-blocking mode... fcntl O_NONBLOCK
checking for perl... /usr/bin/perl
checking for gnroff... no
checking for nroff... /usr/bin/nroff
checking how to use *nroff to get plain text from man pages... -man
checking whether to enable the threaded resolver... yes
checking whether to use POSIX threads for threaded resolver... auto
checking pthread.h usability... yes
checking pthread.h presence... yes
checking for pthread.h... yes
checking for pthread_create... no
checking for pthread_create in -lpthread... yes
checking whether to enable verbose strings... yes
checking whether to enable SSPI support (Windows native builds only)... no
checking whether to enable cryptographic authentication methods... yes
checking whether to enable NTLM delegation to winbind's helper... yes
checking whether to enable TLS-SRP authentication... yes
checking whether to enable Unix domain sockets... auto
checking for struct sockaddr_un.sun_path... yes
checking whether to enable support for cookies... yes
checking whether hiding of library internal symbols will actually happen... yes
configure: using LIBS: -lnghttp2 -lrtmp -lz -lgnutls -lssh2 -Wl,-Bsymbolic-functions -Wl,-z,relro -lssh2 -lgcrypt -lssl -lcrypto -lssl -lcrypto -Wl,-Bsymbolic-functions -Wl,-z,relro -lgssapi_krb5 -lkrb5 -lk5crypto -lcom_err -lldap -llber -lz
configure: LIBS note: LIBS should only be used to specify libraries (-lname).
configure: WARNING: Continuing even with errors mentioned immediately above this line.
checking that generated files are newer than configure... done
configure: creating ./config.status
config.status: creating Makefile
config.status: creating docs/Makefile
config.status: creating docs/examples/Makefile
config.status: creating docs/libcurl/Makefile
config.status: creating docs/libcurl/opts/Makefile
config.status: creating docs/cmdline-opts/Makefile
config.status: creating include/Makefile
config.status: creating include/curl/Makefile
config.status: creating src/Makefile
config.status: creating lib/Makefile
config.status: creating scripts/Makefile
config.status: creating lib/libcurl.vers
config.status: creating tests/Makefile
config.status: creating tests/certs/Makefile
config.status: creating tests/certs/scripts/Makefile
config.status: creating tests/data/Makefile
config.status: creating tests/server/Makefile
config.status: creating tests/libtest/Makefile
config.status: creating tests/unit/Makefile
config.status: creating packages/Makefile
config.status: creating packages/Win32/Makefile
config.status: creating packages/Win32/cygwin/Makefile
config.status: creating packages/Linux/Makefile
config.status: creating packages/Linux/RPM/Makefile
config.status: creating packages/Linux/RPM/curl.spec
config.status: creating packages/Linux/RPM/curl-ssl.spec
config.status: creating packages/Solaris/Makefile
config.status: creating packages/EPM/curl.list
config.status: creating packages/EPM/Makefile
config.status: creating packages/vms/Makefile
config.status: creating packages/AIX/Makefile
config.status: creating packages/AIX/RPM/Makefile
config.status: creating packages/AIX/RPM/curl.spec
config.status: creating curl-config
config.status: creating libcurl.pc
config.status: creating lib/curl_config.h
config.status: executing depfiles commands
config.status: executing libtool commands
configure: amending lib/Makefile
configure: amending src/Makefile
configure: amending tests/unit/Makefile
configure: amending tests/server/Makefile
configure: amending tests/libtest/Makefile
configure: amending docs/examples/Makefile
configure: Configured to build curl/libcurl:

curl version: 7.61.0-DEV
Host setup: x86_64-unknown-linux-gnu
Install prefix: /usr/local
Compiler: gcc
SSL support: enabled (OpenSSL)
SSH support: enabled (libSSH2)
zlib support: enabled
brotli support: no (--with-brotli)
GSS-API support: enabled (MIT Kerberos/Heimdal)
TLS-SRP support: enabled
resolver: POSIX threaded
IPv6 support: enabled
Unix sockets support: enabled
IDN support: no (--with-{libidn2,winidn})
Build libcurl: Shared=no, Static=yes
Built-in manual: enabled
--libcurl option: enabled (--disable-libcurl-option)
Verbose errors: enabled (--disable-verbose)
SSPI support: no (--enable-sspi)
ca cert bundle: /etc/ssl/certs/ca-certificates.crt
ca cert path: no
ca fallback: no
LDAP support: enabled (OpenLDAP)
LDAPS support: enabled
RTSP support: enabled
RTMP support: enabled (librtmp)
metalink support: enabled
PSL support: no (libpsl not found)
HTTP2 support: enabled (nghttp2)
Protocols: DICT FILE FTP FTPS GOPHER HTTP HTTPS IMAP IMAPS LDAP LDAPS POP3 POP3S RTMP RTSP SCP SFTP SMB SMBS SMTP SMTPS TELNET TFTP

testcurl: configure seems to have finished fine

testcurl: display libcurl.pc

prefix=/usr/local
exec_prefix=${prefix}
libdir=${exec_prefix}/lib
includedir=${prefix}/include
supported_protocols="DICT FILE FTP FTPS GOPHER HTTP HTTPS IMAP IMAPS LDAP LDAPS POP3 POP3S RTMP RTSP SCP SFTP SMB SMBS SMTP SMTPS TELNET TFTP"
supported_features="SSL IPv6 UnixSockets libz AsynchDNS GSS-API SPNEGO Kerberos NTLM NTLM_WB TLS-SRP HTTP2 HTTPS-proxy"
Name: libcurl
URL: https://curl.haxx.se/
Description: Library to transfer files with ftp, http, etc.
Version: 7.61.0-DEV
Libs: -L${libdir} -lcurl
Libs.private: -lnghttp2 -lrtmp -lz -lgnutls -lssh2 -Wl,-Bsymbolic-functions -Wl,-z,relro -lssh2 -lgcrypt -lssl -lcrypto -lssl -lcrypto -Wl,-Bsymbolic-functions -Wl,-z,relro -lgssapi_krb5 -lkrb5 -lk5crypto -lcom_err -lldap -llber -lz
Cflags: -I${includedir} -DCURL_STATICLIB

testcurl: display lib/curl_config.h

#define CURLDEBUG 1
#define CURL_CA_BUNDLE "/etc/ssl/certs/ca-certificates.crt"
#define CURL_EXTERN_SYMBOL __attribute__ ((__visibility__ ("default")))
#define CURL_SA_FAMILY_T sa_family_t
#define DEBUGBUILD 1
#define ENABLE_IPV6 1
#define GETHOSTNAME_TYPE_ARG2 size_t
#define GETSERVBYPORT_R_ARGS 6
#define GETSERVBYPORT_R_BUFSIZE 4096
#define HAVE_ALARM 1
#define HAVE_ALLOCA_H 1
#define HAVE_ARPA_INET_H 1
#define HAVE_ARPA_TFTP_H 1
#define HAVE_ASSERT_H 1
#define HAVE_BASENAME 1
#define HAVE_BOOL_T 1
#define HAVE_CLOCK_GETTIME_MONOTONIC 1
#define HAVE_CONNECT 1
#define HAVE_DECL_GETPWUID_R 1
#define HAVE_DLFCN_H 1
#define HAVE_ENGINE_CLEANUP 1
#define HAVE_ERRNO_H 1
#define HAVE_FCNTL 1
#define HAVE_FCNTL_H 1
#define HAVE_FCNTL_O_NONBLOCK 1
#define HAVE_FDOPEN 1
#define HAVE_FNMATCH 1
#define HAVE_FREEADDRINFO 1
#define HAVE_FREEIFADDRS 1
#define HAVE_FSETXATTR 1
#define HAVE_FSETXATTR_5 1
#define HAVE_FTRUNCATE 1
#define HAVE_GAI_STRERROR 1
#define HAVE_GETADDRINFO 1
#define HAVE_GETADDRINFO_THREADSAFE 1
#define HAVE_GETEUID 1
#define HAVE_GETHOSTBYADDR 1
#define HAVE_GETHOSTBYADDR_R 1
#define HAVE_GETHOSTBYADDR_R_8 1
#define HAVE_GETHOSTBYNAME 1
#define HAVE_GETHOSTBYNAME_R 1
#define HAVE_GETHOSTBYNAME_R_6 1
#define HAVE_GETHOSTNAME 1
#define HAVE_GETIFADDRS 1
#define HAVE_GETPPID 1
#define HAVE_GETPWUID 1
#define HAVE_GETPWUID_R 1
#define HAVE_GETRLIMIT 1
#define HAVE_GETSERVBYPORT_R 1
#define HAVE_GETTIMEOFDAY 1
#define HAVE_GMTIME_R 1
#define HAVE_GSSAPI 1
#define HAVE_GSSAPI_GSSAPI_GENERIC_H 1
#define HAVE_GSSAPI_GSSAPI_H 1
#define HAVE_GSSAPI_GSSAPI_KRB5_H 1
#define HAVE_GSSMIT 1
#define HAVE_IFADDRS_H 1
#define HAVE_IF_NAMETOINDEX 1
#define HAVE_INET_NTOP 1
#define HAVE_INET_PTON 1
#define HAVE_INTTYPES_H 1
#define HAVE_IOCTL 1
#define HAVE_IOCTL_FIONBIO 1
#define HAVE_IOCTL_SIOCGIFADDR 1
#define HAVE_LBER_H 1
#define HAVE_LDAP_H 1
#define HAVE_LDAP_INIT_FD 1
#define HAVE_LDAP_SSL 1
#define HAVE_LDAP_URL_PARSE 1
#define HAVE_LIBGEN_H 1
#define HAVE_LIBRTMP_RTMP_H 1
#define HAVE_LIBSSH2 1
#define HAVE_LIBSSH2_H 1
#define HAVE_LIBSSL 1
#define HAVE_LIBZ 1
#define HAVE_LINUX_TCP_H 1
#define HAVE_LL 1
#define HAVE_LOCALE_H 1
#define HAVE_LOCALTIME_R 1
#define HAVE_LONGLONG 1
#define HAVE_MALLOC_H 1
#define HAVE_MEMORY_H 1
#define HAVE_MSG_NOSIGNAL 1
#define HAVE_NETDB_H 1
#define HAVE_NETINET_IN_H 1
#define HAVE_NETINET_TCP_H 1
#define HAVE_NET_IF_H 1
#define HAVE_NGHTTP2_NGHTTP2_H 1
#define HAVE_OPENSSL_CRYPTO_H 1
#define HAVE_OPENSSL_ERR_H 1
#define HAVE_OPENSSL_PEM_H 1
#define HAVE_OPENSSL_RSA_H 1
#define HAVE_OPENSSL_SRP 1
#define HAVE_OPENSSL_SSL_H 1
#define HAVE_OPENSSL_X509_H 1
#define HAVE_PIPE 1
#define HAVE_POLL 1
#define HAVE_POLL_FINE 1
#define HAVE_POLL_H 1
#define HAVE_POSIX_STRERROR_R 1
#define HAVE_PTHREAD_H 1
#define HAVE_PWD_H 1
#define HAVE_RAND_EGD 1
#define HAVE_RECV 1
#define HAVE_SELECT 1
#define HAVE_SEND 1
#define HAVE_SETJMP_H 1
#define HAVE_SETLOCALE 1
#define HAVE_SETRLIMIT 1
#define HAVE_SETSOCKOPT 1
#define HAVE_SGTTY_H 1
#define HAVE_SIGACTION 1
#define HAVE_SIGINTERRUPT 1
#define HAVE_SIGNAL 1
#define HAVE_SIGNAL_H 1
#define HAVE_SIGSETJMP 1
#define HAVE_SIG_ATOMIC_T 1
#define HAVE_SOCKADDR_IN6_SIN6_SCOPE_ID 1
#define HAVE_SOCKET 1
#define HAVE_SOCKETPAIR 1
#define HAVE_SSL_GET_SHUTDOWN 1
#define HAVE_STDBOOL_H 1
#define HAVE_STDINT_H 1
#define HAVE_STDIO_H 1
#define HAVE_STDLIB_H 1
#define HAVE_STRCASECMP 1
#define HAVE_STRDUP 1
#define HAVE_STRERROR_R 1
#define HAVE_STRINGS_H 1
#define HAVE_STRING_H 1
#define HAVE_STRNCASECMP 1
#define HAVE_STROPTS_H 1
#define HAVE_STRSTR 1
#define HAVE_STRTOK_R 1
#define HAVE_STRTOLL 1
#define HAVE_STRUCT_SOCKADDR_STORAGE 1
#define HAVE_STRUCT_TIMEVAL 1
#define HAVE_SYS_IOCTL_H 1
#define HAVE_SYS_PARAM_H 1
#define HAVE_SYS_POLL_H 1
#define HAVE_SYS_RESOURCE_H 1
#define HAVE_SYS_SELECT_H 1
#define HAVE_SYS_SOCKET_H 1
#define HAVE_SYS_STAT_H 1
#define HAVE_SYS_TIME_H 1
#define HAVE_SYS_TYPES_H 1
#define HAVE_SYS_UIO_H 1
#define HAVE_SYS_UN_H 1
#define HAVE_SYS_WAIT_H 1
#define HAVE_SYS_XATTR_H 1
#define HAVE_TERMIOS_H 1
#define HAVE_TERMIO_H 1
#define HAVE_TIME_H 1
#define HAVE_UNISTD_H 1
#define HAVE_UTIME 1
#define HAVE_UTIMES 1
#define HAVE_UTIME_H 1
#define HAVE_VARIADIC_MACROS_C99 1
#define HAVE_VARIADIC_MACROS_GCC 1
#define HAVE_WRITEV 1
#define HAVE_ZLIB_H 1
#define LT_OBJDIR ".libs/"
#define NTLM_WB_ENABLED 1
#define NTLM_WB_FILE "/usr/bin/ntlm_auth"
#define OS "x86_64-unknown-linux-gnu"
#define PACKAGE "curl"
#define PACKAGE_BUGREPORT "a suitable curl mailing list: https://curl.haxx.se/mail/"
#define PACKAGE_NAME "curl"
#define PACKAGE_STRING "curl -"
#define PACKAGE_TARNAME "curl"
#define PACKAGE_URL ""
#define PACKAGE_VERSION "-"
#define RANDOM_FILE "/dev/urandom"
#define RECV_TYPE_ARG1 int
#define RECV_TYPE_ARG2 void *
#define RECV_TYPE_ARG3 size_t
#define RECV_TYPE_ARG4 int
#define RECV_TYPE_RETV ssize_t
#define RETSIGTYPE void
#define SELECT_QUAL_ARG5
#define SELECT_TYPE_ARG1 int
#define SELECT_TYPE_ARG234 fd_set *
#define SELECT_TYPE_ARG5 struct timeval *
#define SELECT_TYPE_RETV int
#define SEND_QUAL_ARG2 const
#define SEND_TYPE_ARG1 int
#define SEND_TYPE_ARG2 void *
#define SEND_TYPE_ARG3 size_t
#define SEND_TYPE_ARG4 int
#define SEND_TYPE_RETV ssize_t
#define SIZEOF_CURL_OFF_T 8
#define SIZEOF_INT 4
#define SIZEOF_LONG 8
#define SIZEOF_OFF_T 8
#define SIZEOF_SHORT 2
#define SIZEOF_SIZE_T 8
#define SIZEOF_TIME_T 8
#define STDC_HEADERS 1
#define STRERROR_R_TYPE_ARG3 size_t
#define TIME_WITH_SYS_TIME 1
#define USE_LIBRTMP 1
#define USE_LIBSSH2 1
#define USE_MANUAL 1
#define USE_METALINK 1
#define USE_NGHTTP2 1
#define USE_OPENLDAP 1
#define USE_OPENSSL 1
#define USE_THREADS_POSIX 1
#define USE_TLS_SRP 1
#define USE_UNIX_SOCKETS 1
#define VERSION "-"
#ifndef _ALL_SOURCE
#endif
#ifndef _DARWIN_USE_64_BIT_INODE
# define _DARWIN_USE_64_BIT_INODE 1
#endif
#ifndef __cplusplus
#endif
testcurl: make -i
Making all in lib
make[1]: Entering directory `/build-20009/lib'
make all-am
make[2]: Entering directory `/build-20009/lib'
CC libcurl_la-file.lo
CC libcurl_la-timeval.lo
CC libcurl_la-base64.lo
CC libcurl_la-hostip.lo
CC libcurl_la-progress.lo
CC libcurl_la-formdata.lo
CC libcurl_la-cookie.lo
CC libcurl_la-http.lo
CC libcurl_la-sendf.lo
CC libcurl_la-ftp.lo
CC libcurl_la-url.lo
CC libcurl_la-dict.lo
CC libcurl_la-if2ip.lo
CC libcurl_la-speedcheck.lo
CC libcurl_la-ldap.lo
CC libcurl_la-version.lo
CC libcurl_la-getenv.lo
CC libcurl_la-escape.lo
CC libcurl_la-mprintf.lo
CC libcurl_la-telnet.lo
CC libcurl_la-netrc.lo
CC libcurl_la-getinfo.lo
CC libcurl_la-transfer.lo
CC libcurl_la-strcase.lo
CC libcurl_la-easy.lo
CC libcurl_la-security.lo
CC libcurl_la-curl_fnmatch.lo
CC libcurl_la-fileinfo.lo
CC libcurl_la-ftplistparser.lo
CC libcurl_la-wildcard.lo
CC libcurl_la-krb5.lo
CC libcurl_la-memdebug.lo
CC libcurl_la-http_chunks.lo
CC libcurl_la-strtok.lo
CC libcurl_la-connect.lo
CC libcurl_la-llist.lo
CC libcurl_la-hash.lo
CC libcurl_la-multi.lo
CC libcurl_la-content_encoding.lo
CC libcurl_la-share.lo
CC libcurl_la-http_digest.lo
CC libcurl_la-md4.lo
CC libcurl_la-md5.lo
CC libcurl_la-http_negotiate.lo
CC libcurl_la-inet_pton.lo
CC libcurl_la-strtoofft.lo
CC libcurl_la-strerror.lo
CC libcurl_la-amigaos.lo
CC libcurl_la-hostasyn.lo
CC libcurl_la-hostip4.lo
CC libcurl_la-hostip6.lo
CC libcurl_la-hostsyn.lo
CC libcurl_la-inet_ntop.lo
CC libcurl_la-parsedate.lo
CC libcurl_la-select.lo
CC libcurl_la-tftp.lo
CC libcurl_la-splay.lo
CC libcurl_la-strdup.lo
CC libcurl_la-socks.lo
CC libcurl_la-ssh.lo
CC libcurl_la-ssh-libssh.lo
CC libcurl_la-curl_addrinfo.lo
CC libcurl_la-socks_gssapi.lo
CC libcurl_la-socks_sspi.lo
CC libcurl_la-curl_sspi.lo
CC libcurl_la-slist.lo
CC libcurl_la-nonblock.lo
CC libcurl_la-curl_memrchr.lo
CC libcurl_la-imap.lo
CC libcurl_la-pop3.lo
CC libcurl_la-smtp.lo
CC libcurl_la-pingpong.lo
CC libcurl_la-rtsp.lo
CC libcurl_la-curl_threads.lo
CC libcurl_la-warnless.lo
CC libcurl_la-hmac.lo
CC libcurl_la-curl_rtmp.lo
CC libcurl_la-openldap.lo
CC libcurl_la-curl_gethostname.lo
CC libcurl_la-gopher.lo
CC libcurl_la-idn_win32.lo
CC libcurl_la-http_proxy.lo
CC libcurl_la-non-ascii.lo
CC libcurl_la-asyn-ares.lo
CC libcurl_la-asyn-thread.lo
CC libcurl_la-curl_gssapi.lo
CC libcurl_la-http_ntlm.lo
CC libcurl_la-curl_ntlm_wb.lo
CC libcurl_la-curl_ntlm_core.lo
CC libcurl_la-curl_sasl.lo
CC libcurl_la-rand.lo
CC libcurl_la-curl_multibyte.lo
CC libcurl_la-hostcheck.lo
CC libcurl_la-conncache.lo
CC libcurl_la-pipeline.lo
CC libcurl_la-dotdot.lo
CC libcurl_la-x509asn1.lo
CC libcurl_la-http2.lo
CC libcurl_la-smb.lo
CC libcurl_la-curl_endian.lo
CC libcurl_la-curl_des.lo
CC libcurl_la-system_win32.lo
CC libcurl_la-mime.lo
CC libcurl_la-sha256.lo
CC libcurl_la-setopt.lo
CC libcurl_la-curl_path.lo
CC libcurl_la-curl_ctype.lo
CC libcurl_la-curl_range.lo
CC libcurl_la-psl.lo
CC vauth/libcurl_la-vauth.lo
CC vauth/libcurl_la-cleartext.lo
CC vauth/libcurl_la-cram.lo
CC vauth/libcurl_la-digest.lo
CC vauth/libcurl_la-digest_sspi.lo
CC vauth/libcurl_la-krb5_gssapi.lo
CC vauth/libcurl_la-krb5_sspi.lo
CC vauth/libcurl_la-ntlm.lo
CC vauth/libcurl_la-ntlm_sspi.lo
CC vauth/libcurl_la-oauth2.lo
CC vauth/libcurl_la-spnego_gssapi.lo
CC vauth/libcurl_la-spnego_sspi.lo
CC vtls/libcurl_la-openssl.lo
CC vtls/libcurl_la-gtls.lo
CC vtls/libcurl_la-vtls.lo
CC vtls/libcurl_la-nss.lo
CC vtls/libcurl_la-polarssl.lo
CC vtls/libcurl_la-polarssl_threadlock.lo
CC vtls/libcurl_la-axtls.lo
CC vtls/libcurl_la-cyassl.lo
CC vtls/libcurl_la-schannel.lo
CC vtls/libcurl_la-schannel_verify.lo
CC vtls/libcurl_la-darwinssl.lo
CC vtls/libcurl_la-gskit.lo
CC vtls/libcurl_la-mbedtls.lo
CCLD libcurl.la
CC libcurlu_la-file.lo
CC libcurlu_la-timeval.lo
CC libcurlu_la-base64.lo
CC libcurlu_la-hostip.lo
CC libcurlu_la-progress.lo
CC libcurlu_la-formdata.lo
CC libcurlu_la-cookie.lo
CC libcurlu_la-http.lo
CC libcurlu_la-sendf.lo
CC libcurlu_la-ftp.lo
CC libcurlu_la-url.lo
CC libcurlu_la-dict.lo
CC libcurlu_la-if2ip.lo
CC libcurlu_la-speedcheck.lo
CC libcurlu_la-ldap.lo
CC libcurlu_la-version.lo
CC libcurlu_la-getenv.lo
CC libcurlu_la-escape.lo
CC libcurlu_la-mprintf.lo
CC libcurlu_la-telnet.lo
CC libcurlu_la-netrc.lo
CC libcurlu_la-getinfo.lo
CC libcurlu_la-transfer.lo
CC libcurlu_la-strcase.lo
CC libcurlu_la-easy.lo
CC libcurlu_la-security.lo
CC libcurlu_la-curl_fnmatch.lo
CC libcurlu_la-fileinfo.lo
CC libcurlu_la-ftplistparser.lo
CC libcurlu_la-wildcard.lo
CC libcurlu_la-krb5.lo
CC libcurlu_la-memdebug.lo
CC libcurlu_la-http_chunks.lo
CC libcurlu_la-strtok.lo
CC libcurlu_la-connect.lo
CC libcurlu_la-llist.lo
CC libcurlu_la-hash.lo
CC libcurlu_la-multi.lo
CC libcurlu_la-content_encoding.lo
CC libcurlu_la-share.lo
CC libcurlu_la-http_digest.lo
CC libcurlu_la-md4.lo
CC libcurlu_la-md5.lo
CC libcurlu_la-http_negotiate.lo
CC libcurlu_la-inet_pton.lo
CC libcurlu_la-strtoofft.lo
CC libcurlu_la-strerror.lo
CC libcurlu_la-amigaos.lo
CC libcurlu_la-hostasyn.lo
CC libcurlu_la-hostip4.lo
CC libcurlu_la-hostip6.lo
CC libcurlu_la-hostsyn.lo
CC libcurlu_la-inet_ntop.lo
CC libcurlu_la-parsedate.lo
CC libcurlu_la-select.lo
CC libcurlu_la-tftp.lo
CC libcurlu_la-splay.lo
CC libcurlu_la-strdup.lo
CC libcurlu_la-socks.lo
CC libcurlu_la-ssh.lo
CC libcurlu_la-ssh-libssh.lo
CC libcurlu_la-curl_addrinfo.lo
CC libcurlu_la-socks_gssapi.lo
CC libcurlu_la-socks_sspi.lo
CC libcurlu_la-curl_sspi.lo
CC libcurlu_la-slist.lo
CC libcurlu_la-nonblock.lo
CC libcurlu_la-curl_memrchr.lo
CC libcurlu_la-imap.lo
CC libcurlu_la-pop3.lo
CC libcurlu_la-smtp.lo
CC libcurlu_la-pingpong.lo
CC libcurlu_la-rtsp.lo
CC libcurlu_la-curl_threads.lo
CC libcurlu_la-warnless.lo
CC libcurlu_la-hmac.lo
CC libcurlu_la-curl_rtmp.lo
CC libcurlu_la-openldap.lo
CC libcurlu_la-curl_gethostname.lo
CC libcurlu_la-gopher.lo
CC libcurlu_la-idn_win32.lo
CC libcurlu_la-http_proxy.lo
CC libcurlu_la-non-ascii.lo
CC libcurlu_la-asyn-ares.lo
CC libcurlu_la-asyn-thread.lo
CC libcurlu_la-curl_gssapi.lo
CC libcurlu_la-http_ntlm.lo
CC libcurlu_la-curl_ntlm_wb.lo
CC libcurlu_la-curl_ntlm_core.lo
CC libcurlu_la-curl_sasl.lo
CC libcurlu_la-rand.lo
CC libcurlu_la-curl_multibyte.lo
CC libcurlu_la-hostcheck.lo
CC libcurlu_la-conncache.lo
CC libcurlu_la-pipeline.lo
CC libcurlu_la-dotdot.lo
CC libcurlu_la-x509asn1.lo
CC libcurlu_la-http2.lo
CC libcurlu_la-smb.lo
CC libcurlu_la-curl_endian.lo
CC libcurlu_la-curl_des.lo
CC libcurlu_la-system_win32.lo
CC libcurlu_la-mime.lo
CC libcurlu_la-sha256.lo
CC libcurlu_la-setopt.lo
CC libcurlu_la-curl_path.lo
CC libcurlu_la-curl_ctype.lo
CC libcurlu_la-curl_range.lo
CC libcurlu_la-psl.lo
CC vauth/libcurlu_la-vauth.lo
CC vauth/libcurlu_la-cleartext.lo
CC vauth/libcurlu_la-cram.lo
CC vauth/libcurlu_la-digest.lo
CC vauth/libcurlu_la-digest_sspi.lo
CC vauth/libcurlu_la-krb5_gssapi.lo
CC vauth/libcurlu_la-krb5_sspi.lo
CC vauth/libcurlu_la-ntlm.lo
CC vauth/libcurlu_la-ntlm_sspi.lo
CC vauth/libcurlu_la-oauth2.lo
CC vauth/libcurlu_la-spnego_gssapi.lo
CC vauth/libcurlu_la-spnego_sspi.lo
CC vtls/libcurlu_la-openssl.lo
CC vtls/libcurlu_la-gtls.lo
CC vtls/libcurlu_la-vtls.lo
CC vtls/libcurlu_la-nss.lo
CC vtls/libcurlu_la-polarssl.lo
CC vtls/libcurlu_la-polarssl_threadlock.lo
CC vtls/libcurlu_la-axtls.lo
CC vtls/libcurlu_la-cyassl.lo
CC vtls/libcurlu_la-schannel.lo
CC vtls/libcurlu_la-schannel_verify.lo
CC vtls/libcurlu_la-darwinssl.lo
CC vtls/libcurlu_la-gskit.lo
CC vtls/libcurlu_la-mbedtls.lo
CCLD libcurlu.la
/usr/bin/perl /curl/lib/checksrc.pl -D/curl/lib -W/curl/lib/curl_config.h \
/curl/lib/*.[ch] /curl/lib/vauth/*.[ch] /curl/lib/vtls/*.[ch]
make[2]: Leaving directory `/build-20009/lib'
make[1]: Leaving directory `/build-20009/lib'
Making all in src
make[1]: Entering directory `/build-20009/src'
Making all in ../docs
make[2]: Entering directory `/build-20009/docs'
Making all in .
make[3]: Entering directory `/build-20009/docs'
if test "..x" != "/curlx" -a -e "/curl/docs/curl.1"; then \
cp -fp "/curl/docs/curl.1" /build-20009/docs/curl.1; fi
cd cmdline-opts && make
make[4]: Entering directory `/build-20009/docs/cmdline-opts'
/usr/bin/perl /curl/docs/cmdline-opts/gen.pl mainpage /curl/docs/cmdline-opts > ../../docs/curl.1
make[4]: Leaving directory `/build-20009/docs/cmdline-opts'
make[3]: Leaving directory `/build-20009/docs'
Making all in cmdline-opts
make[3]: Entering directory `/build-20009/docs/cmdline-opts'
make[3]: Nothing to be done for `all'.
make[3]: Leaving directory `/build-20009/docs/cmdline-opts'
make[2]: Leaving directory `/build-20009/docs'
make[2]: Entering directory `/build-20009/src'
CC libcurltool_la-slist_wc.lo
CC libcurltool_la-tool_binmode.lo
CC libcurltool_la-tool_bname.lo
CC libcurltool_la-tool_cb_dbg.lo
CC libcurltool_la-tool_cb_hdr.lo
CC libcurltool_la-tool_cb_prg.lo
CC libcurltool_la-tool_cb_rea.lo
CC libcurltool_la-tool_cb_see.lo
CC libcurltool_la-tool_cb_wrt.lo
CC libcurltool_la-tool_cfgable.lo
CC libcurltool_la-tool_convert.lo
CC libcurltool_la-tool_dirhie.lo
CC libcurltool_la-tool_doswin.lo
CC libcurltool_la-tool_easysrc.lo
CC libcurltool_la-tool_filetime.lo
CC libcurltool_la-tool_formparse.lo
CC libcurltool_la-tool_getparam.lo
CC libcurltool_la-tool_getpass.lo
CC libcurltool_la-tool_help.lo
CC libcurltool_la-tool_helpers.lo
CC libcurltool_la-tool_homedir.lo
echo '#include "tool_setup.h"' > tool_hugehelp.c
echo '#ifndef HAVE_LIBZ' >> tool_hugehelp.c
env LC_ALL=C /usr/bin/nroff -man /build-20009/docs/curl.1 | /usr/bin/perl /curl/src/mkhelp.pl /curl/docs/MANUAL >> tool_hugehelp.c
echo '#else' >> tool_hugehelp.c
env LC_ALL=C /usr/bin/nroff -man /build-20009/docs/curl.1 | /usr/bin/perl /curl/src/mkhelp.pl -c /curl/docs/MANUAL >> tool_hugehelp.c
echo '#endif /* HAVE_LIBZ */' >> tool_hugehelp.c
CC libcurltool_la-tool_hugehelp.lo
CC libcurltool_la-tool_libinfo.lo
CC libcurltool_la-tool_main.lo
CC libcurltool_la-tool_metalink.lo
CC libcurltool_la-tool_msgs.lo
CC libcurltool_la-tool_operate.lo
CC libcurltool_la-tool_operhlp.lo
CC libcurltool_la-tool_panykey.lo
CC libcurltool_la-tool_paramhlp.lo
CC libcurltool_la-tool_parsecfg.lo
CC libcurltool_la-tool_strdup.lo
CC libcurltool_la-tool_setopt.lo
CC libcurltool_la-tool_sleep.lo
CC libcurltool_la-tool_urlglob.lo
CC libcurltool_la-tool_util.lo
CC libcurltool_la-tool_vms.lo
CC libcurltool_la-tool_writeout.lo
CC libcurltool_la-tool_xattr.lo
CC ../lib/libcurltool_la-strtoofft.lo
CC ../lib/libcurltool_la-nonblock.lo
CC ../lib/libcurltool_la-warnless.lo
CC ../lib/libcurltool_la-curl_ctype.lo
CCLD libcurltool.la
CC curl-slist_wc.o
CC curl-tool_binmode.o
CC curl-tool_bname.o
CC curl-tool_cb_dbg.o
CC curl-tool_cb_hdr.o
CC curl-tool_cb_prg.o
CC curl-tool_cb_rea.o
CC curl-tool_cb_see.o
CC curl-tool_cb_wrt.o
CC curl-tool_cfgable.o
CC curl-tool_convert.o
CC curl-tool_dirhie.o
CC curl-tool_doswin.o
CC curl-tool_easysrc.o
CC curl-tool_filetime.o
CC curl-tool_formparse.o
CC curl-tool_getparam.o
CC curl-tool_getpass.o
CC curl-tool_help.o
CC curl-tool_helpers.o
CC curl-tool_homedir.o
CC curl-tool_hugehelp.o
CC curl-tool_libinfo.o
CC curl-tool_main.o
CC curl-tool_metalink.o
CC curl-tool_msgs.o
CC curl-tool_operate.o
CC curl-tool_operhlp.o
CC curl-tool_panykey.o
CC curl-tool_paramhlp.o
CC curl-tool_parsecfg.o
CC curl-tool_strdup.o
CC curl-tool_setopt.o
CC curl-tool_sleep.o
CC curl-tool_urlglob.o
CC curl-tool_util.o
CC curl-tool_vms.o
CC curl-tool_writeout.o
CC curl-tool_xattr.o
CC ../lib/curl-strtoofft.o
CC ../lib/curl-nonblock.o
CC ../lib/curl-warnless.o
CC ../lib/curl-curl_ctype.o
CCLD curl
/usr/bin/perl /curl/lib/checksrc.pl -D/curl/src \
-W/curl/src/tool_hugehelp.c /curl/src/*.[ch]
make[2]: Leaving directory `/build-20009/src'
make[1]: Leaving directory `/build-20009/src'
make[1]: Entering directory `/build-20009'
make[1]: Nothing to be done for `all-am'.
make[1]: Leaving directory `/build-20009'
testcurl: libcurl was created fine (libcurl.la)
testcurl: curl was created fine (curl)
testcurl: display curl --version output
curl 7.61.0-DEV (x86_64-unknown-linux-gnu) libcurl/7.61.0-DEV OpenSSL/1.0.1f zlib/1.2.8 libssh2/1.4.3 nghttp2/1.11.1 librtmp/2.3
Release-Date: [unreleased]
Protocols: dict file ftp ftps gopher http https imap imaps ldap ldaps pop3 pop3s rtmp rtsp scp sftp smb smbs smtp smtps telnet tftp
Features: AsynchDNS Debug TrackMemory IPv6 Largefile GSS-API Kerberos SPNEGO NTLM NTLM_WB SSL libz TLS-SRP HTTP2 UnixSockets HTTPS-proxy Metalink
testcurl: make -k test-full
make[1]: Entering directory `/build-20009/tests'
Making all in certs
make[2]: Entering directory `/build-20009/tests/certs'
Making all in scripts
make[3]: Entering directory `/build-20009/tests/certs/scripts'
make[3]: Nothing to be done for `all'.
make[3]: Leaving directory `/build-20009/tests/certs/scripts'
make[3]: Entering directory `/build-20009/tests/certs'
make[3]: Nothing to be done for `all-am'.
make[3]: Leaving directory `/build-20009/tests/certs'
make[2]: Leaving directory `/build-20009/tests/certs'
Making all in data
make[2]: Entering directory `/build-20009/tests/data'
make[2]: Nothing to be done for `all'.
make[2]: Leaving directory `/build-20009/tests/data'
Making all in server
make[2]: Entering directory `/build-20009/tests/server'
CC ../../lib/getpart-mprintf.o
CC ../../lib/getpart-nonblock.o
CC ../../lib/getpart-strtoofft.o
CC ../../lib/getpart-warnless.o
CC ../../lib/getpart-curl_ctype.o
CC getpart-getpart.o
CC ../../lib/getpart-base64.o
CC ../../lib/getpart-memdebug.o
CC getpart-testpart.o
CCLD getpart
CC ../../lib/resolve-mprintf.o
CC ../../lib/resolve-nonblock.o
CC ../../lib/resolve-strtoofft.o
CC ../../lib/resolve-warnless.o
CC ../../lib/resolve-curl_ctype.o
CC resolve-getpart.o
CC ../../lib/resolve-base64.o
CC ../../lib/resolve-memdebug.o
CC resolve-util.o
CC resolve-resolve.o
CCLD resolve
CC ../../lib/rtspd-mprintf.o
CC ../../lib/rtspd-nonblock.o
CC ../../lib/rtspd-strtoofft.o
CC ../../lib/rtspd-warnless.o
CC ../../lib/rtspd-curl_ctype.o
CC rtspd-getpart.o
CC ../../lib/rtspd-base64.o
CC ../../lib/rtspd-memdebug.o
CC rtspd-util.o
CC rtspd-rtspd.o
CCLD rtspd
CC ../../lib/sockfilt-mprintf.o
CC ../../lib/sockfilt-nonblock.o
CC ../../lib/sockfilt-strtoofft.o
CC ../../lib/sockfilt-warnless.o
CC ../../lib/sockfilt-curl_ctype.o
CC sockfilt-getpart.o
CC ../../lib/sockfilt-base64.o
CC ../../lib/sockfilt-memdebug.o
CC sockfilt-util.o
CC sockfilt-sockfilt.o
CC ../../lib/sockfilt-inet_pton.o
CCLD sockfilt
CC ../../lib/sws-mprintf.o
CC ../../lib/sws-nonblock.o
CC ../../lib/sws-strtoofft.o
CC ../../lib/sws-warnless.o
CC ../../lib/sws-curl_ctype.o
CC sws-getpart.o
CC ../../lib/sws-base64.o
CC ../../lib/sws-memdebug.o
CC sws-util.o
CC sws-sws.o
CC ../../lib/sws-inet_pton.o
CCLD sws
CC ../../lib/tftpd-mprintf.o
CC ../../lib/tftpd-nonblock.o
CC ../../lib/tftpd-strtoofft.o
CC ../../lib/tftpd-warnless.o
CC ../../lib/tftpd-curl_ctype.o
CC tftpd-getpart.o
CC ../../lib/tftpd-base64.o
CC ../../lib/tftpd-memdebug.o
CC tftpd-util.o
CC tftpd-tftpd.o
CCLD tftpd
CC ../../lib/fake_ntlm-mprintf.o
CC ../../lib/fake_ntlm-nonblock.o
CC ../../lib/fake_ntlm-strtoofft.o
CC ../../lib/fake_ntlm-warnless.o
CC ../../lib/fake_ntlm-curl_ctype.o
CC fake_ntlm-getpart.o
CC ../../lib/fake_ntlm-base64.o
CC ../../lib/fake_ntlm-memdebug.o
CC fake_ntlm-util.o
CC fake_ntlm-fake_ntlm.o
CCLD fake_ntlm
/usr/bin/perl /curl/lib/checksrc.pl /curl/tests/server/*.c
make[2]: Leaving directory `/build-20009/tests/server'
Making all in libtest
make[2]: Entering directory `/build-20009/tests/libtest'
CC libstubgss_la-stub_gssapi.lo
CCLD libstubgss.la
CC chkhostname-chkhostname.o
CC ../../lib/chkhostname-curl_gethostname.o
CCLD chkhostname
CC libauthretry-libauthretry.o
CC libauthretry-first.o
CCLD libauthretry
CC libntlmconnect-libntlmconnect.o
CC libntlmconnect-first.o
CC libntlmconnect-testutil.o
CC ../../lib/libntlmconnect-warnless.o
CCLD libntlmconnect
CC lib500-lib500.o
CC lib500-first.o
CC lib500-testutil.o
CC lib500-testtrace.o
CCLD lib500
CC lib501-lib501.o
CC lib501-first.o
CCLD lib501
CC lib502-lib502.o
CC lib502-first.o
CC lib502-testutil.o
CC ../../lib/lib502-warnless.o
CCLD lib502
CC lib503-lib503.o
CC lib503-first.o
CC lib503-testutil.o
CC ../../lib/lib503-warnless.o
CCLD lib503
CC lib504-lib504.o
CC lib504-first.o
CC lib504-testutil.o
CC ../../lib/lib504-warnless.o
CCLD lib504
CC lib505-lib505.o
CC lib505-first.o
CCLD lib505
CC lib506-lib506.o
CC lib506-first.o
CCLD lib506
CC lib507-lib507.o
CC lib507-first.o
CC lib507-testutil.o
CC ../../lib/lib507-warnless.o
CCLD lib507
CC lib508-lib508.o
CC lib508-first.o
CCLD lib508
CC lib509-lib509.o
CC lib509-first.o
CCLD lib509
CC lib510-lib510.o
CC lib510-first.o
CCLD lib510
CC lib511-lib511.o
CC lib511-first.o
CCLD lib511
CC lib512-lib512.o
CC lib512-first.o
CCLD lib512
CC lib513-lib513.o
CC lib513-first.o
CCLD lib513
CC lib514-lib514.o
CC lib514-first.o
CCLD lib514
CC lib515-lib515.o
CC lib515-first.o
CCLD lib515
CC lib516-lib516.o
CC lib516-first.o
CCLD lib516
CC lib517-lib517.o
CC lib517-first.o
CCLD lib517
CC lib518-lib518.o
CC lib518-first.o
CC ../../lib/lib518-warnless.o
CCLD lib518
CC lib519-lib519.o
CC lib519-first.o
CCLD lib519
CC lib520-lib520.o
CC lib520-first.o
CCLD lib520
CC lib521-lib521.o
CC lib521-first.o
CCLD lib521
CC lib523-lib523.o
CC lib523-first.o
CCLD lib523
CC lib524-lib524.o
CC lib524-first.o
CCLD lib524
CC lib525-lib525.o
CC lib525-first.o
CC lib525-testutil.o
CC ../../lib/lib525-warnless.o
CCLD lib525
CC lib526-lib526.o
CC lib526-first.o
CC lib526-testutil.o
CC ../../lib/lib526-warnless.o
CCLD lib526
CC lib527-lib526.o
CC lib527-first.o
CC lib527-testutil.o
CC ../../lib/lib527-warnless.o
CCLD lib527
CC lib529-lib525.o
CC lib529-first.o
CC lib529-testutil.o
CC ../../lib/lib529-warnless.o
CCLD lib529
CC lib530-lib530.o
CC lib530-first.o
CC lib530-testutil.o
CC ../../lib/lib530-warnless.o
CCLD lib530
CC lib532-lib526.o
CC lib532-first.o
CC lib532-testutil.o
CC ../../lib/lib532-warnless.o
CCLD lib532
CC lib533-lib533.o
CC lib533-first.o
CC lib533-testutil.o
CC ../../lib/lib533-warnless.o
CCLD lib533
CC lib536-lib536.o
CC lib536-first.o
CC lib536-testutil.o
CC ../../lib/lib536-warnless.o
CCLD lib536
CC lib537-lib537.o
CC lib537-first.o
CC ../../lib/lib537-warnless.o
CCLD lib537
CC lib539-lib539.o
CC lib539-first.o
CCLD lib539
CC lib540-lib540.o
CC lib540-first.o
CC lib540-testutil.o
CC ../../lib/lib540-warnless.o
CCLD lib540
CC lib541-lib541.o
CC lib541-first.o
CCLD lib541
CC lib542-lib542.o
CC lib542-first.o
CCLD lib542
CC lib543-lib543.o
CC lib543-first.o
CCLD lib543
CC lib544-lib544.o
CC lib544-first.o
CCLD lib544
CC lib545-lib544.o
CC lib545-first.o
CCLD lib545
CC lib547-lib547.o
CC lib547-first.o
CCLD lib547
CC lib548-lib547.o
CC lib548-first.o
CCLD lib548
CC lib549-lib549.o
CC lib549-first.o
CCLD lib549
CC lib552-lib552.o
CC lib552-first.o
CC ../../lib/lib552-warnless.o
CCLD lib552
CC lib553-lib553.o
CC lib553-first.o
CCLD lib553
CC lib554-lib554.o
CC lib554-first.o
CCLD lib554
CC lib555-lib555.o
CC lib555-first.o
CC lib555-testutil.o
CC ../../lib/lib555-warnless.o
CCLD lib555
CC lib556-lib556.o
CC lib556-first.o
CC ../../lib/lib556-warnless.o
CCLD lib556
CC lib557-lib557.o
CC lib557-first.o
CCLD lib557
CC lib558-lib558.o
CC lib558-first.o
CCLD lib558
CC lib559-lib559.o
CC lib559-first.o
CCLD lib559
CC lib560-lib560.o
CC lib560-first.o
CC lib560-testutil.o
CC ../../lib/lib560-warnless.o
CCLD lib560
CC lib562-lib562.o
CC lib562-first.o
CCLD lib562
CC lib564-lib564.o
CC lib564-first.o
CC lib564-testutil.o
CC ../../lib/lib564-warnless.o
CCLD lib564
CC lib565-lib510.o
CC lib565-first.o
CCLD lib565
CC lib566-lib566.o
CC lib566-first.o
CCLD lib566
CC lib567-lib567.o
CC lib567-first.o
CCLD lib567
CC lib568-lib568.o
CC lib568-first.o
CCLD lib568
CC lib569-lib569.o
CC lib569-first.o
CCLD lib569
CC lib570-lib570.o
CC lib570-first.o
CCLD lib570
CC lib571-lib571.o
CC lib571-first.o
CC ../../lib/lib571-warnless.o
CCLD lib571
CC lib572-lib572.o
CC lib572-first.o
CCLD lib572
CC lib573-lib573.o
CC lib573-first.o
CC lib573-testutil.o
CC ../../lib/lib573-warnless.o
CC lib573-testtrace.o
CCLD lib573
CC lib574-lib574.o
CC lib574-first.o
CCLD lib574
CC lib575-lib575.o
CC lib575-first.o
CC lib575-testutil.o
CC ../../lib/lib575-warnless.o
CCLD lib575
CC lib576-lib576.o
CC lib576-first.o
CCLD lib576
CC lib578-lib578.o
CC lib578-first.o
CCLD lib578
CC lib579-lib579.o
CC lib579-first.o
CCLD lib579
CC lib582-lib582.o
CC lib582-first.o
CC lib582-testutil.o
CC ../../lib/lib582-warnless.o
CCLD lib582
CC lib583-lib583.o
CC lib583-first.o
CCLD lib583
CC lib585-lib500.o
CC lib585-first.o
CC lib585-testutil.o
CC lib585-testtrace.o
CCLD lib585
CC lib586-lib586.o
CC lib586-first.o
CCLD lib586
CC lib587-lib554.o
CC lib587-first.o
CCLD lib587
CC lib589-lib589.o
CC lib589-first.o
CCLD lib589
CC lib590-lib590.o
CC lib590-first.o
CCLD lib590
CC lib591-lib591.o
CC lib591-first.o
CC lib591-testutil.o
CC ../../lib/lib591-warnless.o
CCLD lib591
CC lib597-lib597.o
CC lib597-first.o
CC lib597-testutil.o
CC ../../lib/lib597-warnless.o
CCLD lib597
CC lib598-lib598.o
CC lib598-first.o
CCLD lib598
CC lib599-lib599.o
CC lib599-first.o
CCLD lib599
CC lib643-lib643.o
CC lib643-first.o
CCLD lib643
CC lib644-lib643.o
CC lib644-first.o
CCLD lib644
CC lib645-lib643.o
CC lib645-first.o
CCLD lib645
CC lib650-lib650.o
CC lib650-first.o
CCLD lib650
CC lib651-lib651.o
CC lib651-first.o
CCLD lib651
CC lib652-lib652.o
CC lib652-first.o
CCLD lib652
CC lib653-lib653.o
CC lib653-first.o
CCLD lib653
CC lib654-lib654.o
CC lib654-first.o
CCLD lib654
CC lib655-lib655.o
CC lib655-first.o
CCLD lib655
CC lib1156-lib1156.o
CC lib1156-first.o
CC lib1156-testutil.o
CC ../../lib/lib1156-warnless.o
CCLD lib1156
CC lib1500-lib1500.o
CC lib1500-first.o
CC lib1500-testutil.o
CCLD lib1500
CC lib1501-lib1501.o
CC lib1501-first.o
CC lib1501-testutil.o
CC ../../lib/lib1501-warnless.o
CCLD lib1501
CC lib1502-lib1502.o
CC lib1502-first.o
CC lib1502-testutil.o
CC ../../lib/lib1502-warnless.o
CCLD lib1502
CC lib1503-lib1502.o
CC lib1503-first.o
CC lib1503-testutil.o
CC ../../lib/lib1503-warnless.o
CCLD lib1503
CC lib1504-lib1502.o
CC lib1504-first.o
CC lib1504-testutil.o
CC ../../lib/lib1504-warnless.o
CCLD lib1504
CC lib1505-lib1502.o
CC lib1505-first.o
CC lib1505-testutil.o
CC ../../lib/lib1505-warnless.o
CCLD lib1505
CC lib1506-lib1506.o
CC lib1506-first.o
CC lib1506-testutil.o
CC ../../lib/lib1506-warnless.o
CCLD lib1506
CC lib1507-lib1507.o
CC lib1507-first.o
CC lib1507-testutil.o
CC ../../lib/lib1507-warnless.o
CCLD lib1507
CC lib1508-lib1508.o
CC lib1508-first.o
CC lib1508-testutil.o
CC ../../lib/lib1508-warnless.o
CCLD lib1508
CC lib1509-lib1509.o
CC lib1509-first.o
CC lib1509-testutil.o
CC ../../lib/lib1509-warnless.o
CCLD lib1509
CC lib1510-lib1510.o
CC lib1510-first.o
CC lib1510-testutil.o
CC ../../lib/lib1510-warnless.o
CCLD lib1510
CC lib1511-lib1511.o
CC lib1511-first.o
CC lib1511-testutil.o
CC ../../lib/lib1511-warnless.o
CCLD lib1511
CC lib1512-lib1512.o
CC lib1512-first.o
CC lib1512-testutil.o
CC ../../lib/lib1512-warnless.o
CCLD lib1512
CC lib1513-lib1513.o
CC lib1513-first.o
CC lib1513-testutil.o
CC ../../lib/lib1513-warnless.o
CCLD lib1513
CC lib1514-lib1514.o
CC lib1514-first.o
CC lib1514-testutil.o
CC ../../lib/lib1514-warnless.o
CCLD lib1514
CC lib1515-lib1515.o
CC lib1515-first.o
CC lib1515-testutil.o
CC ../../lib/lib1515-warnless.o
CCLD lib1515
CC lib1517-lib1517.o
CC lib1517-first.o
CCLD lib1517
CC lib1520-lib1520.o
CC lib1520-first.o
CCLD lib1520
/usr/bin/perl /curl/tests/libtest/mk-lib1521.pl < /curl/include/curl/curl.h > lib1521.c
CC lib1521-lib1521.o
CC lib1521-first.o
CCLD lib1521
CC lib1525-lib1525.o
CC lib1525-first.o
CC lib1525-testutil.o
CC ../../lib/lib1525-warnless.o
CCLD lib1525
CC lib1526-lib1526.o
CC lib1526-first.o
CC lib1526-testutil.o
CC ../../lib/lib1526-warnless.o
CCLD lib1526
CC lib1527-lib1527.o
CC lib1527-first.o
CC lib1527-testutil.o
CC ../../lib/lib1527-warnless.o
CCLD lib1527
CC lib1528-lib1528.o
CC lib1528-first.o
CC lib1528-testutil.o
CC ../../lib/lib1528-warnless.o
CCLD lib1528
CC lib1529-lib1529.o
CC lib1529-first.o
CC lib1529-testutil.o
CC ../../lib/lib1529-warnless.o
CCLD lib1529
CC lib1530-lib1530.o
CC lib1530-first.o
CC lib1530-testutil.o
CC ../../lib/lib1530-warnless.o
CCLD lib1530
CC lib1531-lib1531.o
CC lib1531-first.o
CC lib1531-testutil.o
CC ../../lib/lib1531-warnless.o
CCLD lib1531
CC lib1532-lib1532.o
CC lib1532-first.o
CC lib1532-testutil.o
CC ../../lib/lib1532-warnless.o
CCLD lib1532
CC lib1533-lib1533.o
CC lib1533-first.o
CC lib1533-testutil.o
CC ../../lib/lib1533-warnless.o
CCLD lib1533
CC lib1534-lib1534.o
CC lib1534-first.o
CC lib1534-testutil.o
CC ../../lib/lib1534-warnless.o
CCLD lib1534
CC lib1535-lib1535.o
CC lib1535-first.o
CC lib1535-testutil.o
CC ../../lib/lib1535-warnless.o
CCLD lib1535
CC lib1536-lib1536.o
CC lib1536-first.o
CC lib1536-testutil.o
CC ../../lib/lib1536-warnless.o
CCLD lib1536
CC lib1537-lib1537.o
CC lib1537-first.o
CC lib1537-testutil.o
CC ../../lib/lib1537-warnless.o
CCLD lib1537
CC lib1538-lib1538.o
CC lib1538-first.o
CC lib1538-testutil.o
CC ../../lib/lib1538-warnless.o
CCLD lib1538
CC lib1540-lib1540.o
CC lib1540-first.o
CC lib1540-testutil.o
CC ../../lib/lib1540-warnless.o
CCLD lib1540
CC lib1550-lib1550.o
CC lib1550-first.o
CCLD lib1550
CC lib1551-lib1551.o
CC lib1551-first.o
CCLD lib1551
CC lib1552-lib1552.o
CC lib1552-first.o
CC lib1552-testutil.o
CCLD lib1552
CC lib1553-lib1553.o
CC lib1553-first.o
CC lib1553-testutil.o
CCLD lib1553
CC lib1554-lib1554.o
CC lib1554-first.o
CCLD lib1554
CC lib1555-lib1555.o
CC lib1555-first.o
CC lib1555-testutil.o
CC ../../lib/lib1555-warnless.o
CCLD lib1555
CC lib1556-lib1556.o
CC lib1556-first.o
CC lib1556-testutil.o
CC ../../lib/lib1556-warnless.o
CCLD lib1556
CC lib1557-lib1557.o
CC lib1557-first.o
CC lib1557-testutil.o
CC ../../lib/lib1557-warnless.o
CCLD lib1557
CC lib1900-lib1900.o
CC lib1900-first.o
CC lib1900-testutil.o
CC ../../lib/lib1900-warnless.o
CCLD lib1900
CC lib2033-libntlmconnect.o
CC lib2033-first.o
CC lib2033-testutil.o
CC ../../lib/lib2033-warnless.o
CCLD lib2033
make[2]: Leaving directory `/build-20009/tests/libtest'
Making all in unit
make[2]: Entering directory `/build-20009/tests/unit'
CC unit1300-unit1300.o
CC ../libtest/unit1300-first.o
CCLD unit1300
CC unit1301-unit1301.o
CC ../libtest/unit1301-first.o
CCLD unit1301
CC unit1302-unit1302.o
CC ../libtest/unit1302-first.o
CCLD unit1302
CC unit1303-unit1303.o
CC ../libtest/unit1303-first.o
CCLD unit1303
CC unit1304-unit1304.o
CC ../libtest/unit1304-first.o
CCLD unit1304
CC unit1305-unit1305.o
CC ../libtest/unit1305-first.o
CCLD unit1305
CC unit1307-unit1307.o
CC ../libtest/unit1307-first.o
CCLD unit1307
CC unit1308-unit1308.o
CC ../libtest/unit1308-first.o
CCLD unit1308
CC unit1309-unit1309.o
CC ../libtest/unit1309-first.o
CCLD unit1309
CC unit1323-unit1323.o
CC ../libtest/unit1323-first.o
CCLD unit1323
CC unit1330-unit1330.o
CC ../libtest/unit1330-first.o
CCLD unit1330
CC unit1394-unit1394.o
CC ../libtest/unit1394-first.o
CCLD unit1394
CC unit1395-unit1395.o
CC ../libtest/unit1395-first.o
CCLD unit1395
CC unit1396-unit1396.o
CC ../libtest/unit1396-first.o
CCLD unit1396
CC unit1397-unit1397.o
CC ../libtest/unit1397-first.o
CCLD unit1397
CC unit1398-unit1398.o
CC ../libtest/unit1398-first.o
CCLD unit1398
CC unit1399-unit1399.o
CC ../libtest/unit1399-first.o
CCLD unit1399
CC unit1600-unit1600.o
CC ../libtest/unit1600-first.o
CCLD unit1600
CC unit1601-unit1601.o
CC ../libtest/unit1601-first.o
CCLD unit1601
CC unit1602-unit1602.o
CC ../libtest/unit1602-first.o
CCLD unit1602
CC unit1603-unit1603.o
CC ../libtest/unit1603-first.o
CCLD unit1603
CC unit1604-unit1604.o
CC ../libtest/unit1604-first.o
CCLD unit1604
CC unit1605-unit1605.o
CC ../libtest/unit1605-first.o
CCLD unit1605
CC unit1606-unit1606.o
CC ../libtest/unit1606-first.o
CCLD unit1606
CC unit1607-unit1607.o
CC ../libtest/unit1607-first.o
CCLD unit1607
CC unit1608-unit1608.o
CC ../libtest/unit1608-first.o
CCLD unit1608
CC unit1609-unit1609.o
CC ../libtest/unit1609-first.o
CCLD unit1609
make[2]: Leaving directory `/build-20009/tests/unit'
make[2]: Entering directory `/build-20009/tests'
cd libtest && make checksrc
make[3]: Entering directory `/build-20009/tests/libtest'
/usr/bin/perl /curl/lib/checksrc.pl /curl/tests/libtest/*.c
make[3]: Leaving directory `/build-20009/tests/libtest'
cd unit && make checksrc
make[3]: Entering directory `/build-20009/tests/unit'
/usr/bin/perl /curl/lib/checksrc.pl /curl/tests/unit/*.c
make[3]: Leaving directory `/build-20009/tests/unit'
cd server && make checksrc
make[3]: Entering directory `/build-20009/tests/server'
/usr/bin/perl /curl/lib/checksrc.pl /curl/tests/server/*.c
make[3]: Leaving directory `/build-20009/tests/server'
make[2]: Leaving directory `/build-20009/tests'
srcdir=/curl/tests /usr/bin/perl -I/curl/tests /curl/tests/runtests.pl -a -p -r
********* System characteristics ********
* curl 7.61.0-DEV (x86_64-unknown-linux-gnu)
* libcurl/7.61.0-DEV OpenSSL/1.0.1f zlib/1.2.8 libssh2/1.4.3 nghttp2/1.11.1 librtmp/2.3
* Features: AsynchDNS Debug TrackMemory IPv6 Largefile GSS-API Kerberos SPNEGO NTLM NTLM_WB SSL libz TLS-SRP HTTP2 UnixSockets HTTPS-proxy Metalink
* Host: server018
* System: Linux server018 3.16.0-77-generic #99~14.04.1-Ubuntu SMP Tue Jun 28 19:17:10 UTC 2016 x86_64 x86_64 x86_64 GNU/Linux
*
*** DISABLES memory tracking when using threaded resolver
*
* Servers: SSL HTTP-IPv6 HTTP-unix FTP-IPv6
* Env:
*****************************************
RUN: failed to start the HTTP server
== Contents of files in the log/ dir after test 1
=== Start of file curlverout.log
curl 7.61.0-DEV (x86_64-unknown-linux-gnu) libcurl/7.61.0-DEV OpenSSL/1.0.1f zlib/1.2.8 libssh2/1.4.3 nghttp2/1.11.1 librtmp/2.3
Release-Date: [unreleased]
Protocols: dict file ftp ftps gopher http https imap imaps ldap ldaps pop3 pop3s rtmp rtsp scp sftp smb smbs smtp smtps telnet tftp
Features: AsynchDNS Debug TrackMemory IPv6 Largefile GSS-API Kerberos SPNEGO NTLM NTLM_WB SSL libz TLS-SRP HTTP2 UnixSockets HTTPS-proxy Metalink
=== End of file curlverout.log
=== Start of file http_server.log
14:42:44.429100 Error binding socket on port 8990: (98) Address already in use
14:42:44.430115 ========> sws quits
=== End of file http_server.log
test 0001 SKIPPED: failed starting HTTP server
test 0002 SKIPPED: failed starting HTTP server
test 0003 SKIPPED: failed starting HTTP server
test 0019...[attempt connect to non-listening socket]
------e--- OK (19 out of 1192, remaining: 05:26)
test 0020...[attempt connect to non-existing host name]
------e--- OK (20 out of 1192, remaining: 05:29)
test 0075...[HTTP, urlglob retrieval with bad range]
s-----e--- OK (75 out of 1192, remaining: 01:28)
test 0076...[HTTP, -O with no file name part in the URL]
------e--- OK (76 out of 1192, remaining: 01:28)
test 0096 SKIPPED: curl lacks TrackMemory support
goto problem 2
Failed to start sockfilt! at /curl/tests/ftpserver.pl line 434.
RUN: failed to start the FTP server
== Contents of files in the log/ dir after test 100
=== Start of file ftp_server.log
14:42:51.076217 Failed sockfilt command: ./server/sockfilt --ipv4 --port 8992 --pidfile "./.ftp_sockctrl.pid" --logfile "./log/ftp_sockctrl.log"
=== End of file ftp_server.log
=== Start of file ftp_sockctrl.log
14:42:51.890543 Error binding socket on port 8992: (98) Address already in use
14:42:51.891301 ============> sockfilt quits
=== End of file ftp_sockctrl.log
test 0100 SKIPPED: failed starting FTP server
test 0101 SKIPPED: failed starting FTP server
test 0102 SKIPPED: failed starting FTP server
test 0165 SKIPPED: curl lacks idn support
test 0200...[basic file:// file]
--d---e--- OK (200 out of 1192, remaining: 00:57)
test 0201...[missing file:// file]
------e--- OK (201 out of 1192, remaining: 00:57)
test 0202...[two file:// URLs to stdout]
s-----e--- OK (202 out of 1192, remaining: 00:56)
test 0203...[file:/path URL with a single slash]
--d---e--- OK (203 out of 1192, remaining: 00:56)
test 0204...["upload" with file://]
-----oe--- OK (204 out of 1192, remaining: 00:56)
test 0205...["upload" with file://]
------e--- OK (205 out of 1192, remaining: 00:56)
test 0219...[try using proxy with unsupported scheme]
------e--- OK (219 out of 1192, remaining: 00:52)
test 0231...[file:// with resume]
--d---e--- OK (231 out of 1192, remaining: 00:49)
RUN: failed to start the HTTP-IPv6 server
== Contents of files in the log/ dir after test 240
=== Start of file http_ipv6_server.log
14:42:56.511458 Error binding socket on port 8994: (98) Address already in use
14:42:56.512146 ========> sws quits
=== End of file http_ipv6_server.log
test 0240 SKIPPED: failed starting HTTP-IPv6 server
test 0241 SKIPPED: failed starting HTTP-IPv6 server
test 0242 SKIPPED: failed starting HTTP-IPv6 server
goto problem 3
Failed to start sockfilt! at /curl/tests/ftpserver.pl line 434.
RUN: failed to start the FTP-IPv6 server
== Contents of files in the log/ dir after test 252
=== Start of file ftp_ipv6_server.log
14:43:01.825316 Failed sockfilt command: ./server/sockfilt --ipv6 --port 8996 --pidfile "./.ftp_ipv6_sockctrl.pid" --logfile "./log/ftp_ipv6_sockctrl.log"
=== End of file ftp_ipv6_server.log
=== Start of file ftp_ipv6_sockctrl.log
14:43:01.640307 Error binding socket on port 8996: (98) Address already in use
14:43:01.645007 ============> sockfilt quits
=== End of file ftp_ipv6_sockctrl.log
=== Start of file http_ipv6_server.log
14:42:56.511458 Error binding socket on port 8994: (98) Address already in use
14:42:56.512146 ========> sws quits
=== End of file http_ipv6_server.log
test 0252 SKIPPED: failed starting FTP-IPv6 server
test 0253 SKIPPED: failed starting FTP-IPv6 server
test 0254 SKIPPED: failed starting FTP-IPv6 server
test 0271...[TFTP retrieve]
-pd---e--- OK (271 out of 1192, remaining: 01:23)
test 0283...[TFTP retrieve on invalid file]
-p----e--- OK (283 out of 1192, remaining: 01:18)
test 0284...[TFTP retrieve of boundary case 512 byte file]
-pd---e--- OK (284 out of 1192, remaining: 01:18)
test 0285...[TFTP send]
-p-u--e--- OK (285 out of 1192, remaining: 01:34)
test 0286...[TFTP send of boundary case 512 byte file]
-p-u--e--- OK (286 out of 1192, remaining: 01:50)
test 0288...[file:// with (unsupported) proxy, authentication and range]
--d---e--- OK (288 out of 1192, remaining: 01:49)
test 0314 SKIPPED: curl lacks brotli support
test 0315 SKIPPED: curl lacks brotli support
test 0316 SKIPPED: curl lacks brotli support
test 0320 SKIPPED: no gnutls-serv
test 0321 SKIPPED: no gnutls-serv
test 0322 SKIPPED: no gnutls-serv
test 0501...[simple libcurl attempt operation without URL set]
------e--- OK (347 out of 1192, remaining: 01:25)
test 0502...[simple multi file:// get]
--d---e--- OK (348 out of 1192, remaining: 01:25)
test 0504...[simple multi through local proxy without listener]
------e--- OK (350 out of 1192, remaining: 01:25)
test 0506 SKIPPED: curl has threaded-resolver support
test 0509...[initialization with memory callbacks and actual usage]
s-----e--- OK (355 out of 1192, remaining: 01:24)
test 0517...[curl_getdate() testing]
------e--- OK (363 out of 1192, remaining: 01:21)
test 0543...[curl_easy_escape]
s-----e--- OK (389 out of 1192, remaining: 01:14)
test 0557...[curl_mprintf() testing]
s-----e--- OK (403 out of 1192, remaining: 01:10)
test 0558 SKIPPED: curl lacks TrackMemory support
RUN: failed to start the RTSP server
== Contents of files in the log/ dir after test 567
=== Start of file rtsp_server.log
14:43:20.675873 Error binding socket on port 9007: (98) Address already in use
14:43:20.677090 ========> rtspd quits
=== End of file rtsp_server.log
test 0567 SKIPPED: failed starting RTSP server
test 0568 SKIPPED: failed starting RTSP server
test 0569 SKIPPED: failed starting RTSP server
RUN: failed to start the SSH server
test 0582 SKIPPED: failed starting SSH server
test 0583 SKIPPED: failed starting SSH server
test 0600 SKIPPED: failed starting SSH server
test 0632...[SFTP syntactically invalid host key]
------e--- OK (477 out of 1192, remaining: 01:29)
goto problem 4
Failed to start sockfilt! at /curl/tests/ftpserver.pl line 434.
RUN: failed to start the SMTP server
== Contents of files in the log/ dir after test 646
=== Start of file smtp_server.log
14:43:44.294595 Failed sockfilt command: ./server/sockfilt --ipv4 --port 9005 --pidfile "./.smtp_sockfilt.pid" --logfile "./log/smtp_sockfilt.log"
=== End of file smtp_server.log
=== Start of file smtp_sockfilt.log
14:43:44.109696 Error binding socket on port 9005: (98) Address already in use
14:43:44.111459 ============> sockfilt quits
=== End of file smtp_sockfilt.log
test 0646 SKIPPED: failed starting SMTP server
goto problem 5
Failed to start sockfilt! at /curl/tests/ftpserver.pl line 434.
RUN: failed to start the IMAP server
== Contents of files in the log/ dir after test 647
=== Start of file imap_server.log
14:43:49.297583 Failed sockfilt command: ./server/sockfilt --ipv4 --port 9003 --pidfile "./.imap_sockfilt.pid" --logfile "./log/imap_sockfilt.log"
=== End of file imap_server.log
=== Start of file imap_sockfilt.log
14:43:49.112436 Error binding socket on port 9003: (98) Address already in use
14:43:49.113216 ============> sockfilt quits
=== End of file imap_sockfilt.log
=== Start of file smtp_server.log
14:43:44.294595 Failed sockfilt command: ./server/sockfilt --ipv4 --port 9005 --pidfile "./.smtp_sockfilt.pid" --logfile "./log/smtp_sockfilt.log"
=== End of file smtp_server.log
=== Start of file smtp_sockfilt.log
14:43:44.109696 Error binding socket on port 9005: (98) Address already in use
14:43:44.111459 ============> sockfilt quits
=== End of file smtp_sockfilt.log
test 0647 SKIPPED: failed starting IMAP server
test 0648 SKIPPED: failed starting SMTP server
test 0649 SKIPPED: failed starting SMTP server
test 0800 SKIPPED: failed starting IMAP server
test 0801 SKIPPED: failed starting IMAP server
goto problem 6
Failed to start sockfilt! at /curl/tests/ftpserver.pl line 434.
RUN: failed to start the POP3 server
== Contents of files in the log/ dir after test 850
=== Start of file imap_server.log
14:43:49.297583 Failed sockfilt command: ./server/sockfilt --ipv4 --port 9003 --pidfile "./.imap_sockfilt.pid" --logfile "./log/imap_sockfilt.log"
=== End of file imap_server.log
=== Start of file imap_sockfilt.log
14:43:49.112436 Error binding socket on port 9003: (98) Address already in use
14:43:49.113216 ============> sockfilt quits
=== End of file imap_sockfilt.log
=== Start of file pop3_server.log
14:43:54.748448 Failed sockfilt command: ./server/sockfilt --ipv4 --port 9001 --pidfile "./.pop3_sockfilt.pid" --logfile "./log/pop3_sockfilt.log"
=== End of file pop3_server.log
=== Start of file pop3_sockfilt.log
14:43:54.558026 Error binding socket on port 9001: (98) Address already in use
14:43:54.558673 ============> sockfilt quits
=== End of file pop3_sockfilt.log
=== Start of file smtp_server.log
14:43:44.294595 Failed sockfilt command: ./server/sockfilt --ipv4 --port 9005 --pidfile "./.smtp_sockfilt.pid" --logfile "./log/smtp_sockfilt.log"
=== End of file smtp_server.log
=== Start of file smtp_sockfilt.log
14:43:44.109696 Error binding socket on port 9005: (98) Address already in use
14:43:44.111459 ============> sockfilt quits
=== End of file smtp_sockfilt.log
test 0850 SKIPPED: failed starting POP3 server
test 0851 SKIPPED: failed starting POP3 server
test 0852 SKIPPED: failed starting POP3 server
test 1007...[TFTP send with invalid permission on server]
-p----e--- OK (663 out of 1192, remaining: 01:00)
test 1009...[TFTP retrieve with --local-port]
-pd---e--- OK (665 out of 1192, remaining: 00:59)
test 1013...[Compare curl --version with curl-config --protocols]
------e--- OK (669 out of 1192, remaining: 00:59)
test 1014...[Compare curl --version with curl-config --features]
------e--- OK (670 out of 1192, remaining: 00:59)
test 1016...[X-Y range on a file:// URL to stdout]
s-----e--- OK (672 out of 1192, remaining: 00:58)
test 1017...[0-Y range on a file:// URL to stdout]
s-----e--- OK (673 out of 1192, remaining: 00:58)
test 1018...[X-X range on a file:// URL to stdout]
s-----e--- OK (674 out of 1192, remaining: 00:58)
test 1019...[X- range on a file:// URL to stdout]
s-----e--- OK (675 out of 1192, remaining: 00:58)
test 1020...[-Y range on a file:// URL to stdout]
s-----e--- OK (676 out of 1192, remaining: 00:58)
test 1022...[Compare curl --version with curl-config --version]
------e--- OK (678 out of 1192, remaining: 00:57)
test 1023...[Compare curl --version with curl-config --vernum]
------e--- OK (679 out of 1192, remaining: 00:57)
test 1026...[curl --manual ]
------e--- OK (682 out of 1192, remaining: 00:57)
test 1027...[curl --help]
------e--- OK (683 out of 1192, remaining: 00:57)
test 1034 SKIPPED: curl lacks idn support
test 1035 SKIPPED: curl lacks idn support
test 1049...[TFTP retrieve with localhost --interface]
-pd---e--- OK (705 out of 1192, remaining: 00:53)
test 1063...[Invalid large X- range on a file://]
------e--- OK (719 out of 1192, remaining: 00:50)
test 1084...[HTTP GET with invalid --interface]
------e--- OK (740 out of 1192, remaining: 00:47)
test 1085...[HTTP-IPv6 GET with invalid --interface]
------e--- OK (741 out of 1192, remaining: 00:46)
test 1093...[TFTP retrieve with mode=i]
-pd---e--- OK (749 out of 1192, remaining: 00:45)
test 1094...[TFTP retrieve with mode=netascii]
-pd---e--- OK (750 out of 1192, remaining: 00:45)
test 1099...[TFTP get first a non-existing file then an existing]
sp----e--- OK (755 out of 1192, remaining: 00:44)
test 1119...[Verify that symbols-in-versions and headers are in sync]
------e--- OK (775 out of 1192, remaining: 00:41)
test 1132...[Verify memory #include files in libcurl's C source files]
------e--- OK (788 out of 1192, remaining: 00:40)
test 1135...[Verify CURL_EXTERN order]
s-----e--- OK (791 out of 1192, remaining: 00:39)
test 1136 SKIPPED: curl lacks PSL support
test 1139...[Verify that all libcurl options have man pages]
------e--- OK (795 out of 1192, remaining: 00:39)
test 1140...[Verify the nroff of man pages]
------e--- OK (796 out of 1192, remaining: 00:39)
test 1145...[file:// bad host]
------e--- OK (801 out of 1192, remaining: 00:38)
test 1146...[--proto-default file]
--d---e--- OK (802 out of 1192, remaining: 00:38)
test 1200...[Gopher index]
-pd---e--- OK (820 out of 1192, remaining: 00:37)
test 1201...[Gopher selector]
-pd---e--- OK (821 out of 1192, remaining: 00:37)
test 1202...[Gopher query]
-pd---e--- OK (822 out of 1192, remaining: 00:37)
test 1203...[Gopher IPv6 index]
-pd---e--- OK (823 out of 1192, remaining: 00:37)
test 1220...[file:// URLs with query string]
s-----e--- OK (838 out of 1192, remaining: 00:35)
test 1221...[10 chars object name generation testing]
-----oe--- OK (839 out of 1192, remaining: 00:36)
test 1222...[8 chars object name generation testing]
-----oe--- OK (840 out of 1192, remaining: 00:37)
RUN: failed to start the HTTP2 server
== Contents of files in the log/ dir after test 1230
=== Start of file http2_server.log
14:44:14.711342 Run as proxy, CONNECT to host 127.0.0.1
14:44:14.712386 Error binding socket on port 9013: (98) Address already in use
14:44:14.712578 ========> sws quits
=== End of file http2_server.log
test 1230 SKIPPED: failed starting HTTP-proxy server
test 1234...[abusing {}-globbing]
------e--- OK (852 out of 1192, remaining: 00:38)
test 1236...[[] globbing overflowing the range counter]
------e--- OK (854 out of 1192, remaining: 00:37)
test 1238...[slow TFTP retrieve cancel due to -Y and -y]
-p----e--- OK (856 out of 1192, remaining: 00:39)
test 1242...[TFTP retrieve without TFTP options requests]
-pd---e--- OK (860 out of 1192, remaining: 00:38)
test 1243...[TFTP send without TFTP options requests]
-p-u--e--- OK (861 out of 1192, remaining: 00:40)
test 1247...[--fail-early]
------e--- OK (865 out of 1192, remaining: 00:39)
test 1260...[HTTP URL with rubbish after port number]
------e--- OK (878 out of 1192, remaining: 00:37)
test 1263...[HTTP URL with rubbish after IPv6 bracket]
------e--- OK (881 out of 1192, remaining: 00:37)
test 1264...[HTTP URL with space in host name]
------e--- OK (882 out of 1192, remaining: 00:36)
test 1281...[reject non-numerical port number in URL]
------e--- OK (885 out of 1192, remaining: 00:36)
test 1291...[Attempt to upload 100K files but fail immediately]
------e--- OK (895 out of 1192, remaining: 00:36)
test 1300...[llist unit tests]
------e--- OK (899 out of 1192, remaining: 00:35)
test 1301...[curl_strcasecompare unit tests]
------e--- OK (900 out of 1192, remaining: 00:35)
test 1302...[base64 encode/decode unit tests]
------e--- OK (901 out of 1192, remaining: 00:35)
test 1303...[Curl_timeleft unit tests]
------e--- OK (902 out of 1192, remaining: 00:35)
test 1304...[netrc parsing unit tests]
------e--- OK (903 out of 1192, remaining: 00:35)
test 1305...[internal hash create/destroy testing]
------e--- OK (904 out of 1192, remaining: 00:35)
test 1306...[internal hash create/add/destroy testing]
------e--- OK (905 out of 1192, remaining: 00:35)
test 1307...[internal Curl_fnmatch() testing]

unit1307 returned 5, when expecting 0
goto problem 7
exit FAILED
== Contents of files in the log/ dir after test 1307
=== Start of file stderr1307
URL: -
/curl/tests/unit/unit1307.c:306 test failed: 'pattern mismatch'
/curl/tests/unit/unit1307.c:306 test failed: 'pattern mismatch'
/curl/tests/unit/unit1307.c:306 test failed: 'pattern mismatch'
/curl/tests/unit/unit1307.c:306 test failed: 'pattern mismatch'
/curl/tests/unit/unit1307.c:306 test failed: 'pattern mismatch'
=== End of file stderr1307
=== Start of file stdout1307
Tested with system fnmatch(), linux-style
Curl_fnmatch("[[FF]]", "[FF]") should return FAIL (returns MATCH) [42]
Curl_fnmatch("[![FF]]", "") should return FAIL (returns NOMATCH) [62]
Curl_fnmatch("[![FF]]", "[FF]") should return FAIL (returns NOMATCH) [63]
Curl_fnmatch("[![FF]]", "a") should return FAIL (returns MATCH) [64]
Curl_fnmatch("**]*[*[[13]]**[*[13])]*]*[**[*[13]~r-]*]**[.*]*[[E3][E3][E3][E3][E3][E3][E3][E3][E3][E3][E3][E3][E3][E3][E3][E3][E3][E3][E3][E3][E3][E3][E3][E3][E3][E3][E3][E3][E3]*[[13]]**[*[13])]*]*[*[[13]]*[~r]*]*[BA][13][A6]~b-]*", "a") should return FAIL (returns NOMATCH) [156]
=== End of file stdout1307
test 1308...[formpost unit tests]
------e--- OK (907 out of 1192, remaining: 00:34)
test 1309...[splay unit tests]
s-----e--- OK (908 out of 1192, remaining: 00:34)
test 1323...[curlx_tvdiff]
------e--- OK (921 out of 1192, remaining: 00:32)
test 1330 SKIPPED: curl lacks TrackMemory support
test 1394...[unit test for parse_cert_parameter()]
------e--- OK (992 out of 1192, remaining: 00:22)
test 1395...[Curl_dedotdotify]
------e--- OK (993 out of 1192, remaining: 00:22)
test 1396...[curl_easy_escape and curl_easy_unescape]
------e--- OK (994 out of 1192, remaining: 00:22)
test 1397...[Check wildcard certificate matching function Curl_cert_hostcheck]
------e--- OK (995 out of 1192, remaining: 00:22)
test 1398...[curl_msnprintf unit tests]
------e--- OK (996 out of 1192, remaining: 00:21)
test 1399...[Curl_pgrsTime unit tests]
------e--- OK (997 out of 1192, remaining: 00:21)
test 1409...[Pass in string to -C]
------e--- OK (1007 out of 1192, remaining: 00:20)
test 1410...[Pass in negative number to --max-time]
------e--- OK (1008 out of 1192, remaining: 00:20)
test 1427...[too large -m timeout value]
------e--- OK (1025 out of 1192, remaining: 00:18)
test 1435...[simple HTTP GET over Unix socket]
-pd---e--- OK (1033 out of 1192, remaining: 00:17)
test 1436...[HTTP requests with multiple connections over Unix socket]
sp----e--- OK (1034 out of 1192, remaining: 00:17)
test 1440...[Check --write-out with trailing %{]
s-----e--- OK (1038 out of 1192, remaining: 00:16)
test 1441...[Check --write-out with trailing %]
s-----e--- OK (1039 out of 1192, remaining: 00:16)
test 1442...[Check --write-out with trailing \]
s-----e--- OK (1040 out of 1192, remaining: 00:16)
test 1445...[file:// with --remote-time]
------e--- OK (1043 out of 1192, remaining: 00:16)
test 1447...[Provide illegal proxy name ]
------e--- OK (1045 out of 1192, remaining: 00:16)
test 1450...[Basic DICT lookup]
------e--- OK (1048 out of 1192, remaining: 00:16)
test 1451...[Basic SMB request]
------e--- OK (1049 out of 1192, remaining: 00:16)
test 1452...[Basic TELNET negotiation]
------e--- OK (1050 out of 1192, remaining: 00:16)
test 1453...[Too long tftp filename]
------e--- OK (1051 out of 1192, remaining: 00:16)
test 1454 SKIPPED: curl has ipv6 support
test 1508...[Close a multi handle without using it]
-----oe--- OK (1063 out of 1192, remaining: 00:14)
test 1521...[Test all curl_easy_setopt and curl_easy_getinfo options]
------e--- OK (1072 out of 1192, remaining: 00:13)
test 1530...[CURLOPT_OPENSOCKETFUNCTION returns bad socket]
------e--- OK (1078 out of 1192, remaining: 00:12)
test 1537...[libcurl URL escape/unescape tests]
s-----e--- OK (1085 out of 1192, remaining: 00:12)
test 1538...[libcurl strerror API call tests]
s-----e--- OK (1086 out of 1192, remaining: 00:11)
test 1550...[verify setting pipeling blacklisting options]
------e--- OK (1088 out of 1192, remaining: 00:11)
test 1557...[Removing easy handle that's in the pending connections list doesn't leave behind a dangling entry]
------e--- OK (1095 out of 1192, remaining: 00:10)
test 1600...[NTLM unit tests]
------e--- OK (1097 out of 1192, remaining: 00:10)
test 1601...[MD5 unit tests]
------e--- OK (1098 out of 1192, remaining: 00:10)
test 1602...[Internal hash create/add/destroy testing, exercising clean functions]
------e--- OK (1099 out of 1192, remaining: 00:10)
test 1603...[Internal hash add, retrieval, deletion testing]
------e--- OK (1100 out of 1192, remaining: 00:10)
test 1604...[Test WIN32/MSDOS filename sanitization]
------e--- OK (1101 out of 1192, remaining: 00:10)
test 1605...[Test negative data lengths as input to libcurl functions]
------e--- OK (1102 out of 1192, remaining: 00:10)
test 1606...[verify speedcheck]
------e--- OK (1103 out of 1192, remaining: 00:09)
test 1607...[CURLOPT_RESOLVE parsing]
------e--- OK (1104 out of 1192, remaining: 00:09)
test 1608...[verify DNS shuffling]
------e--- OK (1105 out of 1192, remaining: 00:09)
test 1609...[CURLOPT_RESOLVE parsing]
------e--- OK (1106 out of 1192, remaining: 00:09)
test 1900...[HTTP GET using pipelining]
--d---e--- OK (1111 out of 1192, remaining: 00:09)
test 1901...[HTTP GET using pipelining, blacklisted site]
--d---e--- OK (1112 out of 1192, remaining: 00:09)
test 1902...[HTTP GET using pipelining, broken pipe]
--d---e--- OK (1113 out of 1192, remaining: 00:09)
test 2036...[HTTP, -O with no slash at all in the URL]
------e--- OK (1151 out of 1192, remaining: 00:04)
test 2043 SKIPPED: curl lacks WinSSL support
test 2044...[Attempt to set a default protocol that does not exist]
------e--- OK (1159 out of 1192, remaining: 00:03)
test 2056 SKIPPED: curl lacks ld_preload support
test 2057 SKIPPED: curl lacks ld_preload support
test 2070...[basic file:// file with no authority]
--d---e--- OK (1185 out of 1192, remaining: 00:00)
test 2071...[basic file:// file with "127.0.0.1" hostname]
--d---e--- OK (1186 out of 1192, remaining: 00:00)
test 2072...[file:// with unix path resolution behavior for the case of extra slashes]
--d---e--- OK (1187 out of 1192, remaining: 00:00)
test 2075...[Verify usernames are not allowed in url]
------e--- OK (1190 out of 1192, remaining: 00:00)
Warning: dict server unexpectedly alive
Warning: smb server unexpectedly alive

Test suite total running time breakdown per task...

Spent 0080.742 seconds starting and verifying test harness servers.
Spent 0006.763 seconds reading definitions and doing test preparations.
Spent 0029.827 seconds actually running test tools.
Spent 0017.099 seconds awaiting server logs lock removal.
Spent 0000.772 seconds verifying test results.
Spent 0135.202 seconds doing all of the above.

Test server starting and verification time per test (top 25)...

-time- test
------ ----
18.013 0582
05.008 0001
05.008 0100
05.008 0850
05.008 1230
05.007 0646
05.006 0252
05.006 0567
05.006 0647
05.005 0240
02.568 1900
02.266 1451
02.134 1200
02.133 1203
02.118 1435
02.064 1450
02.060 0271
02.052 1452
00.005 0808
00.004 1248
00.002 1024
00.002 1422
00.001 0002
00.001 0021
00.001 0076

Test definition reading and preparation time per test (top 10)...

-time- test
------ ----
00.493 1298
00.148 1445
00.104 1291
00.094 1282
00.084 1286
00.074 1300
00.063 1283
00.055 2072
00.054 1085
00.045 1309

Test tool execution time per test (top 25)...

-time- test
------ ----
03.611 1291
03.415 1901
02.831 1900
02.785 1222
02.708 1221
02.179 1902
02.053 1238
00.992 1140
00.690 1132
00.319 0020
00.276 1300
00.266 1451
00.205 1139
00.138 0557
00.137 0502
00.132 1201
00.119 0504
00.119 1119
00.112 1203
00.111 0543
00.111 1394
00.104 1200
00.099 0019
00.098 0501
00.093 1202

Test server logs lock removal time per test (top 15)...

-time- test
------ ----
05.024 0285
05.024 1243
05.023 0286
02.008 1238
00.000 0001
00.000 0002
00.000 0003
00.000 0004
00.000 0005
00.000 0006
00.000 0007
00.000 0008
00.000 0009
00.000 0010
00.000 0011

Test results verification time per test (top 10)...

-time- test
------ ----
00.080 1026
00.076 1445
00.060 1013
00.058 1023
00.052 1022
00.051 1027
00.045 1014
00.031 1309
00.021 1291
00.008 1538

Total time per test (top 50)...

-time- test
------ ----
18.015 0582
05.408 1900
05.086 0285
05.080 0286
05.077 1243
05.022 0001
05.019 0252
05.010 1230
05.009 0100
05.009 0646
05.009 0850
05.007 0567
05.007 0647
05.006 0240
04.076 1238
03.736 1291
03.435 1901
02.794 1222
02.715 1221
02.547 1451
02.252 1203
02.244 1200
02.209 1435
02.186 1902
02.140 1452
02.133 0271
02.121 1450
01.003 1140
00.693 1132
00.494 1298
00.351 1300
00.324 0020
00.299 1445
00.208 1139
00.163 1026
00.145 0502
00.145 0557
00.142 1309
00.140 1027
00.137 1201
00.132 2072
00.130 1023
00.128 1085
00.124 0504
00.122 1119
00.116 0543
00.116 1394
00.114 1013
00.114 1022
00.114 1264

TESTDONE: 127 tests out of 128 reported OK: 99%
TESTFAIL: These test cases failed: 1307
TESTDONE: 1203 tests were considered during 135 seconds.
TESTINFO: 1075 tests were skipped due to these restraints:
TESTINFO: "failed starting RTSP server" 7 times (567, 568, 569, 570, 571, 572, 577)
TESTINFO: "failed starting SSH server" 48 times (582, 583, 600, 601, 602, 603, 604, 605, 606 and 39 more)
TESTINFO: "configured as DISABLED" 11 times (594, 836, 882, 938, 1209, 1211, 1316, 1510, 1512 and 2 more)
TESTINFO: "failed starting IMAP server" 52 times (647, 800, 801, 802, 803, 804, 805, 806, 807 and 43 more)
TESTINFO: "failed starting FTP server" 223 times (100, 101, 102, 103, 104, 105, 106, 107, 108 and 214 more)
TESTINFO: "failed starting HTTP-proxy server" 1 times (1230)
TESTINFO: "curl lacks TrackMemory support" 3 times (96, 558, 1330)
TESTINFO: "curl lacks idn support" 6 times (165, 1034, 1035, 1448, 2046, 2047)
TESTINFO: "no gnutls-serv" 4 times (320, 321, 322, 324)
TESTINFO: "curl lacks WinSSL support" 1 times (2043)
TESTINFO: "failed starting HTTP-IPv6 server" 10 times (240, 241, 242, 263, 1046, 1083, 1265, 1324, 1408 and 1 more)
TESTINFO: "failed starting SMTP server" 60 times (646, 648, 649, 652, 900, 901, 902, 903, 904 and 51 more)
TESTINFO: "curl lacks PSL support" 1 times (1136)
TESTINFO: "failed starting POP3 server" 43 times (850, 851, 852, 853, 854, 855, 856, 857, 858 and 34 more)
TESTINFO: "curl has ipv6 support" 1 times (1454)
TESTINFO: "curl lacks ld_preload support" 2 times (2056, 2057)
TESTINFO: "curl has threaded-resolver support" 1 times (506)
TESTINFO: "failed starting HTTP server" 592 times (1, 2, 3, 4, 5, 6, 7, 8, 9 and 583 more)
TESTINFO: "curl lacks brotli support" 3 times (314, 315, 316)
TESTINFO: "failed starting FTP-IPv6 server" 6 times (252, 253, 254, 255, 1048, 1050)
make[1]: *** [full-test] Error 1
make[1]: Leaving directory `/build-20009/tests'
make: *** [test-full] Error 2
testcurl: tests were run
testcurl: the tests were not successful
testcurl: ending nicely
testcurl: removing the build-20009 dir
testcurl: removing the buildlog-20009 file

Download build log