curl / Autobuilds / Log From 2019-01-12

Log from 2019-01-12

Jump down to problem:1 test results

testcurl: NAME = Dan Fandrich
testcurl: EMAIL = dan /at/ coneharvesters.com
testcurl: DESC = Linux 4.14 i686 gcc 5.5.0 glibc 2.22 --disable-proxy
testcurl: NOTES =
testcurl: CONFOPTS = --enable-debug --disable-proxy --without-libpsl --with-libssh2=/usr/local/libssh2
testcurl: RUNTESTOPTS = -a -n -p !proxy !HTTP\ proxy !proxytunnel !SOCKS4 !SOCKS5
testcurl: CPPFLAGS =
testcurl: CFLAGS =
testcurl: LDFLAGS =
testcurl: LIBS =
testcurl: CC =
testcurl: TMPDIR =
testcurl: MAKEFLAGS = -j2
testcurl: ACLOCAL_FLAGS =
testcurl: PKG_CONFIG_PATH =
testcurl: DYLD_LIBRARY_PATH =
testcurl: LD_LIBRARY_PATH =
testcurl: LIBRARY_PATH =
testcurl: SHLIB_PATH =
testcurl: LIBPATH =
testcurl: target =
testcurl: version = 2014-11-25
testcurl: date = Sat Jan 12 02:57:19 2019 UTC
testcurl: /home/autobuild/curl/curl.git is verified to be a fine daily source dir
testcurl: build dir build-2737 was created fine
testcurl: timestamp = [unreleased] UTC
testcurl: configure created (at least it exists)
testcurl: going with gmake as make
checking whether to enable maintainer-specific portions of Makefiles... no
checking whether make supports nested variables... yes
checking whether to enable debug build options... yes
checking whether to enable compiler optimizer... (assumed) no
checking whether to enable strict compiler warnings... yes
checking whether to enable compiler warnings as errors... no
checking whether to enable curl debug memory tracking... (assumed) yes
checking whether to enable hiding of library internal symbols... yes
checking whether to enable c-ares for DNS lookups... no
checking whether to disable dependency on -lrt... (assumed no)
checking for path separator... :
checking for sed... /usr/bin/sed
checking for grep... /usr/bin/grep
checking for egrep... /usr/bin/grep -E
checking for ar... /usr/bin/ar
checking for a BSD-compatible install... /usr/bin/install -c
checking for gcc... gcc
checking whether the C compiler works... yes
checking for C compiler default output file name... a.out
checking for suffix of executables...
checking whether we are cross compiling... no
checking for suffix of object files... o
checking whether we are using the GNU C compiler... yes
checking whether gcc accepts -g... yes
checking for gcc option to accept ISO C89... none needed
checking whether gcc understands -c and -o together... yes
checking how to run the C preprocessor... gcc -E
checking for a sed that does not truncate output... (cached) /usr/bin/sed
checking whether to build with code coverage support... no
checking whether build environment is sane... yes
checking for a thread-safe mkdir -p... /usr/bin/mkdir -p
checking for gawk... gawk
checking whether make sets $(MAKE)... yes
checking for style of include used by make... GNU
checking dependency style of gcc... gcc3
checking curl version... 7.64.0-DEV
checking build system type... i686-pc-linux-gnu
checking host system type... i686-pc-linux-gnu
checking for grep that handles long lines and -e... (cached) /usr/bin/grep
checking for egrep... /usr/bin/grep -E
checking if OS is AIX (to define _ALL_SOURCE)... no
checking if _THREAD_SAFE is already defined... no
checking if _THREAD_SAFE is actually needed... no
checking if _THREAD_SAFE is onwards defined... no
checking if _REENTRANT is already defined... no
checking if _REENTRANT is actually needed... no
checking if _REENTRANT is onwards defined... no
checking for special C compiler options needed for large files... no
checking for _FILE_OFFSET_BITS value needed for large files... 64
checking how to print strings... printf
checking for a sed that does not truncate output... (cached) /usr/bin/sed
checking for fgrep... /usr/bin/grep -F
checking for ld used by gcc... /usr/bin/ld
checking if the linker (/usr/bin/ld) is GNU ld... yes
checking for BSD- or MS-compatible name lister (nm)... /usr/bin/nm -B
checking the name lister (/usr/bin/nm -B) interface... BSD nm
checking whether ln -s works... yes
checking the maximum length of command line arguments... 1572864
checking how to convert i686-pc-linux-gnu file names to i686-pc-linux-gnu format... func_convert_file_noop
checking how to convert i686-pc-linux-gnu file names to toolchain format... func_convert_file_noop
checking for /usr/bin/ld option to reload object files... -r
checking for objdump... objdump
checking how to recognize dependent libraries... pass_all
checking for dlltool... no
checking how to associate runtime and link libraries... printf %s\n
checking for archiver @FILE support... @
checking for strip... strip
checking for ranlib... ranlib
checking command to parse /usr/bin/nm -B output from gcc object... ok
checking for sysroot... no
checking for a working dd... /usr/bin/dd
checking how to truncate binary pipes... /usr/bin/dd bs=4096 count=1
checking for mt... no
checking if : is a manifest tool... no
checking for ANSI C header files... yes
checking for sys/types.h... yes
checking for sys/stat.h... yes
checking for stdlib.h... yes
checking for string.h... yes
checking for memory.h... yes
checking for strings.h... yes
checking for inttypes.h... yes
checking for stdint.h... yes
checking for unistd.h... yes
checking for dlfcn.h... yes
checking for objdir... .libs
checking if gcc supports -fno-rtti -fno-exceptions... no
checking for gcc option to produce PIC... -fPIC -DPIC
checking if gcc PIC flag -fPIC -DPIC works... yes
checking if gcc static flag -static works... yes
checking if gcc supports -c -o file.o... yes
checking if gcc supports -c -o file.o... (cached) yes
checking whether the gcc linker (/usr/bin/ld) supports shared libraries... yes
checking whether -lc should be explicitly linked in... no
checking dynamic linker characteristics... GNU/Linux ld.so
checking how to hardcode library paths into programs... immediate
checking whether stripping libraries is possible... yes
checking if libtool supports shared libraries... yes
checking whether to build shared libraries... yes
checking whether to build static libraries... yes
checking whether to build shared libraries with -version-info... yes
checking whether to build shared libraries with -no-undefined... no
checking whether to build shared libraries with -mimpure-text... no
checking whether to build shared libraries with PIC... yes
checking whether to build static libraries with PIC... no
checking whether to build shared libraries only... no
checking whether to build static libraries only... no
checking for inline... inline
checking if cpp -P is needed... yes
checking if cpp -P works... yes
checking if compiler is DEC/Compaq/HP C... no
checking if compiler is HP-UX C... no
checking if compiler is IBM C... no
checking if compiler is Intel C... no
checking if compiler is clang... no
checking if compiler is GNU C... yes
checking if compiler is LCC... no
checking if compiler is SGI MIPSpro C... no
checking if compiler is SGI MIPS C... no
checking if compiler is SunPro C... no
checking if compiler is Tiny C... no
checking if compiler is Watcom C... no
checking if compiler accepts some basic options... yes
configure: compiler options added: -Werror-implicit-function-declaration
checking if compiler accepts debug enabling options... yes
configure: compiler options added: -g
checking if compiler optimizer assumed setting might be used... yes
checking if compiler accepts optimizer disabling options... yes
configure: compiler options added: -O0
checking if compiler accepts strict warning options... yes
configure: compiler options added: -pedantic -Wall -W -Wpointer-arith -Wwrite-strings -Wunused -Wshadow -Winline -Wnested-externs -Wmissing-declarations -Wmissing-prototypes -Wno-long-long -Wbad-function-cast -Wfloat-equal -Wno-multichar -Wsign-compare -Wundef -Wno-format-nonliteral -Wendif-labels -Wstrict-prototypes -Wdeclaration-after-statement -Wold-style-definition -Wstrict-aliasing=3 -Wcast-align -Wtype-limits -Wold-style-declaration -Wmissing-parameter-type -Wempty-body -Wclobbered -Wignored-qualifiers -Wconversion -Wno-sign-conversion -Wvla -ftree-vrp -Wdouble-promotion -Wformat=2 -Warray-bounds=2 -Wno-system-headers
checking if compiler halts on compilation errors... yes
checking if compiler halts on negative sized arrays... yes
checking if compiler halts on function prototype mismatch... yes
checking if compiler supports hiding library internal symbols... yes
checking if curl debug memory tracking can be enabled... yes
checking for windows.h... no
checking whether build target is a native Windows one... no
checking whether build target supports WIN32 file API... no
checking for good-to-use Mac CFLAGS... no
checking to see if the compiler supports __builtin_available()... no
checking whether to support http... yes
checking whether to support ftp... yes
checking whether to support file... yes
checking whether to support ldap... yes
checking whether to support ldaps... yes
checking whether to support rtsp... yes
checking whether to support proxies... no
checking whether to support dict... yes
checking whether to support telnet... yes
checking whether to support tftp... yes
checking whether to support pop3... yes
checking whether to support imap... yes
checking whether to support smb... yes
checking whether to support smtp... yes
checking whether to support gopher... yes
checking whether to provide built-in manual... yes
checking whether to enable generation of C code... yes
checking whether to use libgcc... no
checking if X/Open network library is required... no
checking for gethostbyname... yes
checking for windows.h... (cached) no
checking for winsock.h... (cached) no
checking for winsock2.h... (cached) no
checking for connect in libraries... yes
checking whether time.h and sys/time.h may both be included... yes
checking for sys/types.h... (cached) yes
checking sys/time.h usability... yes
checking sys/time.h presence... yes
checking for sys/time.h... yes
checking time.h usability... yes
checking time.h presence... yes
checking for time.h... yes
checking for monotonic clock_gettime... yes
checking for clock_gettime in libraries... no additional lib required
checking if monotonic clock_gettime works... yes
checking for pkg-config... /usr/bin/pkg-config
checking for zlib options with pkg-config... found
checking zlib.h usability... yes
checking zlib.h presence... yes
checking for zlib.h... yes
configure: found both libz and libz.h header
checking for BrotliDecoderDecompress in -lbrotlidec... no
checking brotli/decode.h usability... no
checking brotli/decode.h presence... no
checking for brotli/decode.h... no
checking for lber.h... no
checking for ldap.h... no
checking for ldapssl.h... no
checking for ldap_ssl.h... no
checking for LDAP libraries... cannot find LDAP libraries
configure: WARNING: Cannot find libraries for LDAP support: LDAP disabled
checking whether to enable IPv6... yes
checking if struct sockaddr_in6 has sin6_scope_id member... yes
checking if argv can be written to... no
checking if GSS-API support is requested... no
checking whether to enable Windows native SSL/TLS (Windows native builds only)... no
checking whether to enable Apple OS native SSL/TLS... no
checking for pkg-config... (cached) /usr/bin/pkg-config
checking for openssl options with pkg-config... found
configure: pkg-config: SSL_LIBS: "-lssl -lcrypto"
configure: pkg-config: SSL_LDFLAGS: "-L/usr/lib/"
configure: pkg-config: SSL_CPPFLAGS: ""
checking for HMAC_Update in -lcrypto... yes
checking for SSL_connect in -lssl... yes
checking openssl/x509.h usability... yes
checking openssl/x509.h presence... yes
checking for openssl/x509.h... yes
checking openssl/rsa.h usability... yes
checking openssl/rsa.h presence... yes
checking for openssl/rsa.h... yes
checking openssl/crypto.h usability... yes
checking openssl/crypto.h presence... yes
checking for openssl/crypto.h... yes
checking openssl/pem.h usability... yes
checking openssl/pem.h presence... yes
checking for openssl/pem.h... yes
checking openssl/ssl.h usability... yes
checking openssl/ssl.h presence... yes
checking for openssl/ssl.h... yes
checking openssl/err.h usability... yes
checking openssl/err.h presence... yes
checking for openssl/err.h... yes
checking for RAND_egd... yes
checking for SSL_get_shutdown... yes
checking for SSLv2_client_method... yes
checking for BoringSSL... no
checking for libressl... no
configure: Added /usr/lib/ to CURL_LIBRARY_PATH
checking for OpenSSL headers version... 1.0.2 - 0x1000211fL
checking for OpenSSL library version... 1.0.2
checking for OpenSSL headers and library versions matching... yes
checking for "/dev/urandom"... yes
checking for SRP_Calc_client_key in -lcrypto... yes
configure: built with one SSL backend
checking default CA cert bundle/path... no
checking whether to use builtin CA store of SSL library... no
checking for libssh2_channel_open_ex in -lssh2... yes
checking libssh2.h usability... yes
checking libssh2.h presence... yes
checking for libssh2.h... yes
configure: Added /usr/local/libssh2/lib to CURL_LIBRARY_PATH
checking for RTMP_Init in -lrtmp... no
checking whether versioned symbols are wanted... no
checking whether to enable Windows native IDN (Windows native builds only)... no
checking whether to build with libidn2... (assumed) yes
checking for pkg-config... (cached) /usr/bin/pkg-config
checking for libidn2 options with pkg-config... no
configure: IDN_LIBS: "-lidn2"
configure: IDN_LDFLAGS: ""
configure: IDN_CPPFLAGS: ""
configure: IDN_DIR: ""
checking if idn2_lookup_ul can be linked... no
checking idn2.h usability... no
checking idn2.h presence... no
checking for idn2.h... no
configure: WARNING: Cannot find libraries for IDN support: IDN disabled
checking for pkg-config... (cached) /usr/bin/pkg-config
checking for libnghttp2 options with pkg-config... no
checking for ANSI C header files... (cached) yes
checking for malloc.h... yes
checking for memory.h... no
checking for sys/types.h... (cached) yes
checking for sys/time.h... (cached) yes
checking for sys/select.h... yes
checking for sys/socket.h... yes
checking for sys/ioctl.h... yes
checking for sys/uio.h... yes
checking for assert.h... yes
checking for unistd.h... (cached) yes
checking for stdlib.h... (cached) yes
checking for arpa/inet.h... yes
checking for net/if.h... yes
checking for netinet/in.h... yes
checking for netinet/in6.h... no
checking for sys/un.h... yes
checking for linux/tcp.h... yes
checking for netinet/tcp.h... yes
checking for netdb.h... yes
checking for sys/sockio.h... no
checking for sys/stat.h... (cached) yes
checking for sys/param.h... yes
checking for termios.h... yes
checking for termio.h... yes
checking for sgtty.h... yes
checking for fcntl.h... yes
checking for alloca.h... yes
checking for time.h... (cached) yes
checking for io.h... no
checking for pwd.h... yes
checking for utime.h... yes
checking for sys/utime.h... no
checking for sys/poll.h... yes
checking for poll.h... yes
checking for socket.h... no
checking for sys/resource.h... yes
checking for libgen.h... yes
checking for locale.h... yes
checking for errno.h... yes
checking for stdbool.h... yes
checking for arpa/tftp.h... yes
checking for sys/filio.h... no
checking for sys/wait.h... yes
checking for setjmp.h... yes
checking for an ANSI C-conforming const... yes
checking for compiler support of C99 variadic macro style... yes
checking for compiler support of old gcc variadic macro style... yes
checking for size_t... yes
checking whether time.h and sys/time.h may both be included... (cached) yes
checking for sys/types.h... (cached) yes
checking for sys/time.h... (cached) yes
checking for time.h... (cached) yes
checking for sys/socket.h... (cached) yes
checking for struct timeval... yes
checking run-time libs availability... fine
checking size of size_t... 4
checking size of long... 4
checking size of int... 4
checking size of short... 2
checking size of time_t... 4
checking size of off_t... 8
checking size of curl_off_t... 8
checking for long long... yes
checking if numberLL works... yes
checking for ssize_t... yes
checking for bool... yes
checking for sa_family_t... yes
checking if time_t is unsigned... no
checking for sys/types.h... (cached) yes
checking for poll.h... (cached) yes
checking for sys/poll.h... (cached) yes
checking for in_addr_t... yes
checking for struct sockaddr_storage... yes
checking signal.h usability... yes
checking signal.h presence... yes
checking for signal.h... yes
checking for sig_atomic_t... yes
checking if sig_atomic_t is already defined as volatile... no
checking return type of signal handlers... void
checking for sys/select.h... (cached) yes
checking for sys/socket.h... (cached) yes
checking for select... yes
checking types of args and return type for select... int,fd_set *,struct timeval *,int
checking for sys/types.h... (cached) yes
checking for sys/socket.h... (cached) yes
checking for recv... yes
checking types of args and return type for recv... int,void *,size_t,int,int
checking for sys/types.h... (cached) yes
checking for sys/socket.h... (cached) yes
checking for send... yes
checking types of args and return type for send... int,const void *,size_t,int,int
checking for sys/types.h... (cached) yes
checking for sys/socket.h... (cached) yes
checking for MSG_NOSIGNAL... yes
checking for sys/types.h... (cached) yes
checking for unistd.h... (cached) yes
checking if alarm can be linked... yes
checking if alarm is prototyped... yes
checking if alarm is compilable... yes
checking if alarm usage allowed... yes
checking if alarm might be used... yes
checking for sys/types.h... (cached) yes
checking for string.h... (cached) yes
checking for strings.h... (cached) yes
checking for sys/types.h... (cached) yes
checking for libgen.h... (cached) yes
checking if basename can be linked... yes
checking if basename is prototyped... yes
checking if basename is compilable... yes
checking if basename usage allowed... yes
checking if basename might be used... yes
checking for sys/types.h... (cached) yes
checking for socket.h... (cached) no
checking if closesocket can be linked... no
checking if closesocket might be used... no
checking for sys/types.h... (cached) yes
checking for sys/socket.h... (cached) yes
checking if CloseSocket can be linked... no
checking if CloseSocket might be used... no
checking if connect can be linked... yes
checking if connect is prototyped... yes
checking if connect is compilable... yes
checking if connect usage allowed... yes
checking if connect might be used... yes
checking for sys/types.h... (cached) yes
checking for unistd.h... (cached) yes
checking for fcntl.h... (cached) yes
checking if fcntl can be linked... yes
checking if fcntl is prototyped... yes
checking if fcntl is compilable... yes
checking if fcntl usage allowed... yes
checking if fcntl might be used... yes
checking if fcntl O_NONBLOCK is compilable... yes
checking if fcntl O_NONBLOCK usage allowed... yes
checking if fcntl O_NONBLOCK might be used... yes
checking for sys/types.h... (cached) yes
checking for stdio.h... yes
checking if fdopen can be linked... yes
checking if fdopen is prototyped... yes
checking if fdopen is compilable... yes
checking if fdopen usage allowed... yes
checking if fdopen might be used... yes
checking for windows.h... (cached) no
checking for winsock2.h... (cached) no
checking for ws2tcpip.h... (cached) no
checking for sys/types.h... (cached) yes
checking for netdb.h... (cached) yes
checking if freeaddrinfo can be linked... yes
checking if freeaddrinfo is prototyped... yes
checking if freeaddrinfo is compilable... yes
checking if freeaddrinfo usage allowed... yes
checking if freeaddrinfo might be used... yes
checking for sys/types.h... (cached) yes
checking for sys/socket.h... (cached) yes
checking for netinet/in.h... (cached) yes
checking for ifaddrs.h... yes
checking if freeifaddrs can be linked... yes
checking if freeifaddrs is prototyped... yes
checking if freeifaddrs is compilable... yes
checking if freeifaddrs usage allowed... yes
checking if freeifaddrs might be used... yes
checking for sys/types.h... (cached) yes
checking for sys/xattr.h... yes
checking if fsetxattr can be linked... yes
checking if fsetxattr is prototyped... yes
checking if fsetxattr takes 5 args.... yes
checking if fsetxattr is compilable... yes
checking if fsetxattr usage allowed... yes
checking if fsetxattr might be used... yes
checking if ftruncate can be linked... yes
checking if ftruncate is prototyped... yes
checking if ftruncate is compilable... yes
checking if ftruncate usage allowed... yes
checking if ftruncate might be used... yes
checking for sys/types.h... (cached) yes
checking for stdlib.h... (cached) yes
checking if getaddrinfo can be linked... yes
checking if getaddrinfo is prototyped... yes
checking if getaddrinfo is compilable... yes
checking if getaddrinfo seems to work... yes
checking if getaddrinfo usage allowed... yes
checking if getaddrinfo might be used... yes
checking if getaddrinfo is threadsafe... yes
checking if gai_strerror can be linked... yes
checking if gai_strerror is prototyped... yes
checking if gai_strerror is compilable... yes
checking if gai_strerror usage allowed... yes
checking if gai_strerror might be used... yes
checking if gethostbyaddr can be linked... yes
checking if gethostbyaddr is prototyped... yes
checking if gethostbyaddr is compilable... yes
checking if gethostbyaddr usage allowed... yes
checking if gethostbyaddr might be used... yes
checking if gethostbyaddr_r can be linked... yes
checking if gethostbyaddr_r is prototyped... yes
checking if gethostbyaddr_r takes 5 args.... no
checking if gethostbyaddr_r takes 7 args.... no
checking if gethostbyaddr_r takes 8 args.... yes
checking if gethostbyaddr_r is compilable... yes
checking if gethostbyaddr_r usage allowed... yes
checking if gethostbyaddr_r might be used... yes
checking if gethostbyname can be linked... yes
checking if gethostbyname is prototyped... yes
checking if gethostbyname is compilable... yes
checking if gethostbyname usage allowed... yes
checking if gethostbyname might be used... yes
checking if gethostbyname_r can be linked... yes
checking if gethostbyname_r is prototyped... yes
checking if gethostbyname_r takes 3 args.... no
checking if gethostbyname_r takes 5 args.... no
checking if gethostbyname_r takes 6 args.... yes
checking if gethostbyname_r is compilable... yes
checking if gethostbyname_r usage allowed... yes
checking if gethostbyname_r might be used... yes
checking if gethostname can be linked... yes
checking if gethostname is prototyped... yes
checking if gethostname is compilable... yes
checking for gethostname arg 2 data type... unsigned int
checking if gethostname usage allowed... yes
checking if gethostname might be used... yes
checking if getifaddrs can be linked... yes
checking if getifaddrs is prototyped... yes
checking if getifaddrs is compilable... yes
checking if getifaddrs seems to work... yes
checking if getifaddrs usage allowed... yes
checking if getifaddrs might be used... yes
checking if getservbyport_r can be linked... yes
checking if getservbyport_r is prototyped... yes
checking if getservbyport_r takes 4 args.... no
checking if getservbyport_r takes 5 args.... no
checking if getservbyport_r takes 6 args.... yes
checking if getservbyport_r is compilable... yes
checking if getservbyport_r usage allowed... yes
checking if getservbyport_r might be used... yes
checking for sys/types.h... (cached) yes
checking for sys/time.h... (cached) yes
checking for time.h... (cached) yes
checking if gmtime_r can be linked... yes
checking if gmtime_r is prototyped... yes
checking if gmtime_r is compilable... yes
checking if gmtime_r seems to work... yes
checking if gmtime_r usage allowed... yes
checking if gmtime_r might be used... yes
checking for sys/types.h... (cached) yes
checking for sys/socket.h... (cached) yes
checking for netinet/in.h... (cached) yes
checking for arpa/inet.h... (cached) yes
checking if inet_ntoa_r can be linked... no
checking if inet_ntoa_r might be used... no
checking if inet_ntop can be linked... yes
checking if inet_ntop is prototyped... yes
checking if inet_ntop is compilable... yes
checking if inet_ntop seems to work... yes
checking if inet_ntop usage allowed... yes
checking if inet_ntop might be used... yes
checking if inet_pton can be linked... yes
checking if inet_pton is prototyped... yes
checking if inet_pton is compilable... yes
checking if inet_pton seems to work... yes
checking if inet_pton usage allowed... yes
checking if inet_pton might be used... yes
checking for sys/types.h... (cached) yes
checking for unistd.h... (cached) yes
checking for sys/socket.h... (cached) yes
checking for sys/ioctl.h... (cached) yes
checking for stropts.h... yes
checking if ioctl can be linked... yes
checking if ioctl is prototyped... yes
checking if ioctl is compilable... yes
checking if ioctl usage allowed... yes
checking if ioctl might be used... yes
checking if ioctl FIONBIO is compilable... yes
checking if ioctl FIONBIO usage allowed... yes
checking if ioctl FIONBIO might be used... yes
checking if ioctl SIOCGIFADDR is compilable... yes
checking if ioctl SIOCGIFADDR usage allowed... yes
checking if ioctl SIOCGIFADDR might be used... yes
checking if ioctlsocket can be linked... no
checking if ioctlsocket might be used... no
checking if IoctlSocket can be linked... no
checking if IoctlSocket might be used... no
checking if localtime_r can be linked... yes
checking if localtime_r is prototyped... yes
checking if localtime_r is compilable... yes
checking if localtime_r seems to work... yes
checking if localtime_r usage allowed... yes
checking if localtime_r might be used... yes
checking if memrchr can be linked... yes
checking if memrchr is prototyped... no
checking if memrchr might be used... no
checking if poll can be linked... yes
checking if poll is prototyped... yes
checking if poll is compilable... yes
checking if poll seems to work... yes
checking if poll usage allowed... yes
checking if poll might be used... yes
checking if setsockopt can be linked... yes
checking if setsockopt is prototyped... yes
checking if setsockopt is compilable... yes
checking if setsockopt usage allowed... yes
checking if setsockopt might be used... yes
checking if setsockopt SO_NONBLOCK is compilable... no
checking if setsockopt SO_NONBLOCK might be used... no
checking for sys/types.h... (cached) yes
checking for signal.h... (cached) yes
checking if sigaction can be linked... yes
checking if sigaction is prototyped... yes
checking if sigaction is compilable... yes
checking if sigaction usage allowed... yes
checking if sigaction might be used... yes
checking if siginterrupt can be linked... yes
checking if siginterrupt is prototyped... yes
checking if siginterrupt is compilable... yes
checking if siginterrupt usage allowed... yes
checking if siginterrupt might be used... yes
checking if signal can be linked... yes
checking if signal is prototyped... yes
checking if signal is compilable... yes
checking if signal usage allowed... yes
checking if signal might be used... yes
checking for sys/types.h... (cached) yes
checking for setjmp.h... (cached) yes
checking if sigsetjmp can be linked... no
checking if sigsetjmp seems a macro... yes
checking if sigsetjmp is compilable... yes
checking if sigsetjmp usage allowed... yes
checking if sigsetjmp might be used... yes
checking if socket can be linked... yes
checking if socket is prototyped... yes
checking if socket is compilable... yes
checking if socket usage allowed... yes
checking if socket might be used... yes
checking if socketpair can be linked... yes
checking if socketpair is prototyped... yes
checking if socketpair is compilable... yes
checking if socketpair usage allowed... yes
checking if socketpair might be used... yes
checking if strcasecmp can be linked... yes
checking if strcasecmp is prototyped... yes
checking if strcasecmp is compilable... yes
checking if strcasecmp usage allowed... yes
checking if strcasecmp might be used... yes
checking if strcmpi can be linked... no
checking if strcmpi might be used... no
checking if strdup can be linked... yes
checking if strdup is prototyped... yes
checking if strdup is compilable... yes
checking if strdup usage allowed... yes
checking if strdup might be used... yes
checking if strerror_r can be linked... yes
checking if strerror_r is prototyped... yes
checking if strerror_r is compilable... yes
checking if strerror_r is glibc like... no
checking if strerror_r is POSIX like... yes
checking if strerror_r seems to work... yes
checking if strerror_r usage allowed... yes
checking if strerror_r might be used... yes
checking if stricmp can be linked... no
checking if stricmp might be used... no
checking if strncasecmp can be linked... yes
checking if strncasecmp is prototyped... yes
checking if strncasecmp is compilable... yes
checking if strncasecmp usage allowed... yes
checking if strncasecmp might be used... yes
checking if strncmpi can be linked... no
checking if strncmpi might be used... no
checking if strnicmp can be linked... no
checking if strnicmp might be used... no
checking if strstr can be linked... yes
checking if strstr is prototyped... yes
checking if strstr is compilable... yes
checking if strstr usage allowed... yes
checking if strstr might be used... yes
checking if strtok_r can be linked... yes
checking if strtok_r is prototyped... yes
checking if strtok_r is compilable... yes
checking if strtok_r usage allowed... yes
checking if strtok_r might be used... yes
checking if strtoll can be linked... yes
checking if strtoll is prototyped... yes
checking if strtoll is compilable... yes
checking if strtoll usage allowed... yes
checking if strtoll might be used... yes
checking for sys/types.h... (cached) yes
checking for sys/uio.h... (cached) yes
checking if writev can be linked... yes
checking if writev is prototyped... yes
checking if writev is compilable... yes
checking if writev usage allowed... yes
checking if writev might be used... yes
checking whether getpwuid_r is declared... yes
checking for fnmatch... yes
checking for geteuid... yes
checking for getpass_r... no
checking deeper for getpass_r... but still no
checking for getppid... yes
checking for getpwuid... yes
checking for getpwuid_r... yes
checking for getrlimit... yes
checking for gettimeofday... yes
checking for if_nametoindex... yes
checking for mach_absolute_time... no
checking deeper for mach_absolute_time... but still no
checking for pipe... yes
checking for setlocale... yes
checking for setmode... no
checking deeper for setmode... but still no
checking for setrlimit... yes
checking for utime... yes
checking for utimes... yes
checking how to set a socket into non-blocking mode... fcntl O_NONBLOCK
checking for perl... /usr/bin/perl
checking for gnroff... no
checking for nroff... /usr/bin/nroff
checking how to use *nroff to get plain text from man pages... -man
checking whether to enable the threaded resolver... yes
checking whether to use POSIX threads for threaded resolver... auto
checking pthread.h usability... yes
checking pthread.h presence... yes
checking for pthread.h... yes
checking for pthread_create... no
checking for pthread_create in -lpthread... yes
checking whether to enable verbose strings... yes
checking whether to enable SSPI support (Windows native builds only)... no
checking whether to enable cryptographic authentication methods... yes
checking whether to enable NTLM delegation to winbind's helper... yes
checking whether to enable TLS-SRP authentication... yes
checking whether to enable Unix domain sockets... auto
checking for struct sockaddr_un.sun_path... yes
checking whether to enable support for cookies... yes
checking whether hiding of library internal symbols will actually happen... yes
checking that generated files are newer than configure... done
configure: creating ./config.status
config.status: creating Makefile
config.status: creating docs/Makefile
config.status: creating docs/examples/Makefile
config.status: creating docs/libcurl/Makefile
config.status: creating docs/libcurl/opts/Makefile
config.status: creating docs/cmdline-opts/Makefile
config.status: creating include/Makefile
config.status: creating include/curl/Makefile
config.status: creating src/Makefile
config.status: creating lib/Makefile
config.status: creating scripts/Makefile
config.status: creating lib/libcurl.vers
config.status: creating tests/Makefile
config.status: creating tests/certs/Makefile
config.status: creating tests/certs/scripts/Makefile
config.status: creating tests/data/Makefile
config.status: creating tests/server/Makefile
config.status: creating tests/libtest/Makefile
config.status: creating tests/unit/Makefile
config.status: creating packages/Makefile
config.status: creating packages/vms/Makefile
config.status: creating curl-config
config.status: creating libcurl.pc
config.status: creating lib/curl_config.h
config.status: executing depfiles commands
config.status: executing libtool commands
configure: amending lib/Makefile
configure: amending src/Makefile
configure: amending tests/unit/Makefile
configure: amending tests/server/Makefile
configure: amending tests/libtest/Makefile
configure: amending docs/examples/Makefile
configure: Configured to build curl/libcurl:

Host setup: i686-pc-linux-gnu
Install prefix: /usr/local
Compiler: gcc
CFLAGS: -Werror-implicit-function-declaration -g -O0 -pedantic -Wall -W -Wpointer-arith -Wwrite-strings -Wunused -Wshadow -Winline -Wnested-externs -Wmissing-declarations -Wmissing-prototypes -Wno-long-long -Wbad-function-cast -Wfloat-equal -Wno-multichar -Wsign-compare -Wundef -Wno-format-nonliteral -Wendif-labels -Wstrict-prototypes -Wdeclaration-after-statement -Wold-style-definition -Wstrict-aliasing=3 -Wcast-align -Wtype-limits -Wold-style-declaration -Wmissing-parameter-type -Wempty-body -Wclobbered -Wignored-qualifiers -Wconversion -Wno-sign-conversion -Wvla -ftree-vrp -Wdouble-promotion -Wformat=2 -Warray-bounds=2 -Wno-system-headers -pthread
CPPFLAGS: -I/usr/local/libssh2/include
LDFLAGS: -L/usr/lib/ -L/usr/local/libssh2/lib
LIBS: -lssh2 -lssh2 -lssl -lcrypto -lssl -lcrypto -lz

curl version: 7.64.0-DEV
SSL support: enabled (OpenSSL)
SSH support: enabled (libSSH2)
zlib support: enabled
brotli support: no (--with-brotli)
GSS-API support: no (--with-gssapi)
TLS-SRP support: enabled
resolver: POSIX threaded
IPv6 support: enabled
Unix sockets support: enabled
IDN support: no (--with-{libidn2,winidn})
Build libcurl: Shared=yes, Static=yes
Built-in manual: enabled
--libcurl option: enabled (--disable-libcurl-option)
Verbose errors: enabled (--disable-verbose)
SSPI support: no (--enable-sspi)
ca cert bundle: no
ca cert path: no
ca fallback: no
LDAP support: no (--enable-ldap / --with-ldap-lib / --with-lber-lib)
LDAPS support: no (--enable-ldaps)
RTSP support: enabled
RTMP support: no (--with-librtmp)
metalink support: no (--with-libmetalink)
PSL support: no (--with-libpsl)
HTTP2 support: disabled (--with-nghttp2)
Protocols: DICT FILE FTP FTPS GOPHER HTTP HTTPS IMAP IMAPS POP3 POP3S RTSP SCP SFTP SMB SMBS SMTP SMTPS TELNET TFTP

testcurl: configure seems to have finished fine

testcurl: display libcurl.pc

prefix=/usr/local
exec_prefix=${prefix}
libdir=${exec_prefix}/lib
includedir=${prefix}/include
supported_protocols="DICT FILE FTP FTPS GOPHER HTTP HTTPS IMAP IMAPS POP3 POP3S RTSP SCP SFTP SMB SMBS SMTP SMTPS TELNET TFTP"
supported_features="SSL IPv6 UnixSockets libz AsynchDNS NTLM NTLM_WB TLS-SRP HTTPS-proxy"
Name: libcurl
URL: https://curl.haxx.se/
Description: Library to transfer files with ftp, http, etc.
Version: 7.64.0-DEV
Libs: -L${libdir} -lcurl
Libs.private: -lssh2 -lssh2 -lssl -lcrypto -lssl -lcrypto -lz
Cflags: -I${includedir}

testcurl: display lib/curl_config.h

#define CURLDEBUG 1
#define CURL_DISABLE_LDAP 1
#define CURL_DISABLE_LDAPS 1
#define CURL_DISABLE_PROXY 1
#define CURL_EXTERN_SYMBOL __attribute__ ((__visibility__ ("default")))
#define CURL_SA_FAMILY_T sa_family_t
#define DEBUGBUILD 1
#define ENABLE_IPV6 1
#define GETHOSTNAME_TYPE_ARG2 unsigned int
#define GETSERVBYPORT_R_ARGS 6
#define GETSERVBYPORT_R_BUFSIZE 4096
#define HAVE_ALARM 1
#define HAVE_ALLOCA_H 1
#define HAVE_ARPA_INET_H 1
#define HAVE_ARPA_TFTP_H 1
#define HAVE_ASSERT_H 1
#define HAVE_BASENAME 1
#define HAVE_BOOL_T 1
#define HAVE_CLOCK_GETTIME_MONOTONIC 1
#define HAVE_CONNECT 1
#define HAVE_DECL_GETPWUID_R 1
#define HAVE_DLFCN_H 1
#define HAVE_ERRNO_H 1
#define HAVE_FCNTL 1
#define HAVE_FCNTL_H 1
#define HAVE_FCNTL_O_NONBLOCK 1
#define HAVE_FDOPEN 1
#define HAVE_FNMATCH 1
#define HAVE_FREEADDRINFO 1
#define HAVE_FREEIFADDRS 1
#define HAVE_FSETXATTR 1
#define HAVE_FSETXATTR_5 1
#define HAVE_FTRUNCATE 1
#define HAVE_GAI_STRERROR 1
#define HAVE_GETADDRINFO 1
#define HAVE_GETADDRINFO_THREADSAFE 1
#define HAVE_GETEUID 1
#define HAVE_GETHOSTBYADDR 1
#define HAVE_GETHOSTBYADDR_R 1
#define HAVE_GETHOSTBYADDR_R_8 1
#define HAVE_GETHOSTBYNAME 1
#define HAVE_GETHOSTBYNAME_R 1
#define HAVE_GETHOSTBYNAME_R_6 1
#define HAVE_GETHOSTNAME 1
#define HAVE_GETIFADDRS 1
#define HAVE_GETPPID 1
#define HAVE_GETPWUID 1
#define HAVE_GETPWUID_R 1
#define HAVE_GETRLIMIT 1
#define HAVE_GETSERVBYPORT_R 1
#define HAVE_GETTIMEOFDAY 1
#define HAVE_GMTIME_R 1
#define HAVE_IFADDRS_H 1
#define HAVE_IF_NAMETOINDEX 1
#define HAVE_INET_NTOP 1
#define HAVE_INET_PTON 1
#define HAVE_INTTYPES_H 1
#define HAVE_IOCTL 1
#define HAVE_IOCTL_FIONBIO 1
#define HAVE_IOCTL_SIOCGIFADDR 1
#define HAVE_LDAP_SSL 1
#define HAVE_LIBGEN_H 1
#define HAVE_LIBSSH2 1
#define HAVE_LIBSSH2_H 1
#define HAVE_LIBSSL 1
#define HAVE_LIBZ 1
#define HAVE_LINUX_TCP_H 1
#define HAVE_LL 1
#define HAVE_LOCALE_H 1
#define HAVE_LOCALTIME_R 1
#define HAVE_LONGLONG 1
#define HAVE_MALLOC_H 1
#define HAVE_MEMORY_H 1
#define HAVE_MSG_NOSIGNAL 1
#define HAVE_NETDB_H 1
#define HAVE_NETINET_IN_H 1
#define HAVE_NETINET_TCP_H 1
#define HAVE_NET_IF_H 1
#define HAVE_OPENSSL_CRYPTO_H 1
#define HAVE_OPENSSL_ERR_H 1
#define HAVE_OPENSSL_PEM_H 1
#define HAVE_OPENSSL_RSA_H 1
#define HAVE_OPENSSL_SRP 1
#define HAVE_OPENSSL_SSL_H 1
#define HAVE_OPENSSL_X509_H 1
#define HAVE_PIPE 1
#define HAVE_POLL 1
#define HAVE_POLL_FINE 1
#define HAVE_POLL_H 1
#define HAVE_POSIX_STRERROR_R 1
#define HAVE_PTHREAD_H 1
#define HAVE_PWD_H 1
#define HAVE_RAND_EGD 1
#define HAVE_RECV 1
#define HAVE_SELECT 1
#define HAVE_SEND 1
#define HAVE_SETJMP_H 1
#define HAVE_SETLOCALE 1
#define HAVE_SETRLIMIT 1
#define HAVE_SETSOCKOPT 1
#define HAVE_SGTTY_H 1
#define HAVE_SIGACTION 1
#define HAVE_SIGINTERRUPT 1
#define HAVE_SIGNAL 1
#define HAVE_SIGNAL_H 1
#define HAVE_SIGSETJMP 1
#define HAVE_SIG_ATOMIC_T 1
#define HAVE_SOCKADDR_IN6_SIN6_SCOPE_ID 1
#define HAVE_SOCKET 1
#define HAVE_SOCKETPAIR 1
#define HAVE_SSLV2_CLIENT_METHOD 1
#define HAVE_SSL_GET_SHUTDOWN 1
#define HAVE_STDBOOL_H 1
#define HAVE_STDINT_H 1
#define HAVE_STDIO_H 1
#define HAVE_STDLIB_H 1
#define HAVE_STRCASECMP 1
#define HAVE_STRDUP 1
#define HAVE_STRERROR_R 1
#define HAVE_STRINGS_H 1
#define HAVE_STRING_H 1
#define HAVE_STRNCASECMP 1
#define HAVE_STROPTS_H 1
#define HAVE_STRSTR 1
#define HAVE_STRTOK_R 1
#define HAVE_STRTOLL 1
#define HAVE_STRUCT_SOCKADDR_STORAGE 1
#define HAVE_STRUCT_TIMEVAL 1
#define HAVE_SYS_IOCTL_H 1
#define HAVE_SYS_PARAM_H 1
#define HAVE_SYS_POLL_H 1
#define HAVE_SYS_RESOURCE_H 1
#define HAVE_SYS_SELECT_H 1
#define HAVE_SYS_SOCKET_H 1
#define HAVE_SYS_STAT_H 1
#define HAVE_SYS_TIME_H 1
#define HAVE_SYS_TYPES_H 1
#define HAVE_SYS_UIO_H 1
#define HAVE_SYS_UN_H 1
#define HAVE_SYS_WAIT_H 1
#define HAVE_SYS_XATTR_H 1
#define HAVE_TERMIOS_H 1
#define HAVE_TERMIO_H 1
#define HAVE_TIME_H 1
#define HAVE_UNISTD_H 1
#define HAVE_UTIME 1
#define HAVE_UTIMES 1
#define HAVE_UTIME_H 1
#define HAVE_VARIADIC_MACROS_C99 1
#define HAVE_VARIADIC_MACROS_GCC 1
#define HAVE_WRITEV 1
#define HAVE_ZLIB_H 1
#define LT_OBJDIR ".libs/"
#define NTLM_WB_ENABLED 1
#define NTLM_WB_FILE "/usr/bin/ntlm_auth"
#define OS "i686-pc-linux-gnu"
#define PACKAGE "curl"
#define PACKAGE_BUGREPORT "a suitable curl mailing list: https://curl.haxx.se/mail/"
#define PACKAGE_NAME "curl"
#define PACKAGE_STRING "curl -"
#define PACKAGE_TARNAME "curl"
#define PACKAGE_URL ""
#define PACKAGE_VERSION "-"
#define RANDOM_FILE "/dev/urandom"
#define RECV_TYPE_ARG1 int
#define RECV_TYPE_ARG2 void *
#define RECV_TYPE_ARG3 size_t
#define RECV_TYPE_ARG4 int
#define RECV_TYPE_RETV int
#define RETSIGTYPE void
#define SELECT_QUAL_ARG5
#define SELECT_TYPE_ARG1 int
#define SELECT_TYPE_ARG234 fd_set *
#define SELECT_TYPE_ARG5 struct timeval *
#define SELECT_TYPE_RETV int
#define SEND_QUAL_ARG2 const
#define SEND_TYPE_ARG1 int
#define SEND_TYPE_ARG2 void *
#define SEND_TYPE_ARG3 size_t
#define SEND_TYPE_ARG4 int
#define SEND_TYPE_RETV int
#define SIZEOF_CURL_OFF_T 8
#define SIZEOF_INT 4
#define SIZEOF_LONG 4
#define SIZEOF_OFF_T 8
#define SIZEOF_SHORT 2
#define SIZEOF_SIZE_T 4
#define SIZEOF_TIME_T 4
#define STDC_HEADERS 1
#define STRERROR_R_TYPE_ARG3 size_t
#define TIME_WITH_SYS_TIME 1
#define USE_LIBSSH2 1
#define USE_MANUAL 1
#define USE_OPENSSL 1
#define USE_THREADS_POSIX 1
#define USE_TLS_SRP 1
#define USE_UNIX_SOCKETS 1
#define VERSION "-"
#ifndef _ALL_SOURCE
#endif
#ifndef _DARWIN_USE_64_BIT_INODE
# define _DARWIN_USE_64_BIT_INODE 1
#endif
#define _FILE_OFFSET_BITS 64
#ifndef __cplusplus
#endif
testcurl: gmake -i
Making all in lib
gmake[1]: Entering directory '/build-2737/lib'
gmake all-am
gmake[2]: Entering directory '/build-2737/lib'
CC libcurl_la-file.lo
CC libcurl_la-timeval.lo
CC libcurl_la-base64.lo
CC libcurl_la-hostip.lo
CC libcurl_la-progress.lo
CC libcurl_la-formdata.lo
CC libcurl_la-cookie.lo
CC libcurl_la-http.lo
CC libcurl_la-sendf.lo
CC libcurl_la-ftp.lo
CC libcurl_la-url.lo
CC libcurl_la-dict.lo
CC libcurl_la-if2ip.lo
CC libcurl_la-speedcheck.lo
CC libcurl_la-ldap.lo
CC libcurl_la-version.lo
CC libcurl_la-getenv.lo
CC libcurl_la-escape.lo
CC libcurl_la-mprintf.lo
CC libcurl_la-telnet.lo
CC libcurl_la-netrc.lo
CC libcurl_la-getinfo.lo
CC libcurl_la-transfer.lo
CC libcurl_la-strcase.lo
CC libcurl_la-easy.lo
CC libcurl_la-security.lo
CC libcurl_la-curl_fnmatch.lo
CC libcurl_la-fileinfo.lo
CC libcurl_la-ftplistparser.lo
CC libcurl_la-wildcard.lo
CC libcurl_la-krb5.lo
CC libcurl_la-memdebug.lo
CC libcurl_la-http_chunks.lo
CC libcurl_la-strtok.lo
CC libcurl_la-connect.lo
CC libcurl_la-llist.lo
CC libcurl_la-hash.lo
CC libcurl_la-multi.lo
CC libcurl_la-content_encoding.lo
CC libcurl_la-share.lo
CC libcurl_la-http_digest.lo
CC libcurl_la-md4.lo
CC libcurl_la-md5.lo
CC libcurl_la-http_negotiate.lo
CC libcurl_la-inet_pton.lo
CC libcurl_la-strtoofft.lo
CC libcurl_la-strerror.lo
CC libcurl_la-amigaos.lo
CC libcurl_la-hostasyn.lo
CC libcurl_la-hostip4.lo
CC libcurl_la-hostip6.lo
CC libcurl_la-hostsyn.lo
CC libcurl_la-inet_ntop.lo
CC libcurl_la-parsedate.lo
CC libcurl_la-select.lo
CC libcurl_la-tftp.lo
CC libcurl_la-splay.lo
CC libcurl_la-strdup.lo
CC libcurl_la-socks.lo
CC libcurl_la-ssh.lo
CC libcurl_la-ssh-libssh.lo
CC libcurl_la-curl_addrinfo.lo
CC libcurl_la-socks_gssapi.lo
CC libcurl_la-socks_sspi.lo
CC libcurl_la-curl_sspi.lo
CC libcurl_la-slist.lo
CC libcurl_la-nonblock.lo
CC libcurl_la-curl_memrchr.lo
CC libcurl_la-imap.lo
CC libcurl_la-pop3.lo
CC libcurl_la-smtp.lo
CC libcurl_la-pingpong.lo
CC libcurl_la-rtsp.lo
CC libcurl_la-curl_threads.lo
CC libcurl_la-warnless.lo
CC libcurl_la-hmac.lo
CC libcurl_la-curl_rtmp.lo
CC libcurl_la-openldap.lo
CC libcurl_la-curl_gethostname.lo
CC libcurl_la-gopher.lo
CC libcurl_la-idn_win32.lo
CC libcurl_la-http_proxy.lo
CC libcurl_la-non-ascii.lo
CC libcurl_la-asyn-ares.lo
CC libcurl_la-asyn-thread.lo
CC libcurl_la-curl_gssapi.lo
CC libcurl_la-http_ntlm.lo
CC libcurl_la-curl_ntlm_wb.lo
CC libcurl_la-curl_ntlm_core.lo
CC libcurl_la-curl_sasl.lo
CC libcurl_la-rand.lo
CC libcurl_la-curl_multibyte.lo
CC libcurl_la-hostcheck.lo
CC libcurl_la-conncache.lo
CC libcurl_la-pipeline.lo
CC libcurl_la-dotdot.lo
CC libcurl_la-x509asn1.lo
CC libcurl_la-http2.lo
CC libcurl_la-smb.lo
CC libcurl_la-curl_endian.lo
CC libcurl_la-curl_des.lo
CC libcurl_la-system_win32.lo
CC libcurl_la-mime.lo
CC libcurl_la-sha256.lo
CC libcurl_la-setopt.lo
CC libcurl_la-curl_path.lo
CC libcurl_la-curl_ctype.lo
CC libcurl_la-curl_range.lo
CC libcurl_la-psl.lo
CC libcurl_la-doh.lo
CC libcurl_la-urlapi.lo
CC libcurlu_la-file.lo
CC libcurlu_la-timeval.lo
CC libcurlu_la-base64.lo
CC libcurlu_la-hostip.lo
CC libcurlu_la-progress.lo
CC libcurlu_la-formdata.lo
CC libcurlu_la-cookie.lo
CC libcurlu_la-http.lo
CC libcurlu_la-sendf.lo
CC libcurlu_la-ftp.lo
CC libcurlu_la-url.lo
CC libcurlu_la-dict.lo
CC libcurlu_la-if2ip.lo
CC libcurlu_la-speedcheck.lo
CC libcurlu_la-ldap.lo
CC libcurlu_la-version.lo
CC libcurlu_la-getenv.lo
CC libcurlu_la-escape.lo
CC libcurlu_la-mprintf.lo
CC libcurlu_la-telnet.lo
CC libcurlu_la-netrc.lo
CC libcurlu_la-getinfo.lo
CC libcurlu_la-transfer.lo
CC libcurlu_la-strcase.lo
CC libcurlu_la-easy.lo
CC libcurlu_la-security.lo
CC libcurlu_la-curl_fnmatch.lo
CC libcurlu_la-fileinfo.lo
CC libcurlu_la-ftplistparser.lo
CC libcurlu_la-wildcard.lo
CC libcurlu_la-krb5.lo
CC libcurlu_la-memdebug.lo
CC libcurlu_la-http_chunks.lo
CC libcurlu_la-strtok.lo
CC libcurlu_la-connect.lo
CC libcurlu_la-llist.lo
CC libcurlu_la-hash.lo
CC libcurlu_la-multi.lo
CC libcurlu_la-content_encoding.lo
CC libcurlu_la-share.lo
CC libcurlu_la-http_digest.lo
CC libcurlu_la-md4.lo
CC libcurlu_la-md5.lo
CC libcurlu_la-http_negotiate.lo
CC libcurlu_la-inet_pton.lo
CC libcurlu_la-strtoofft.lo
CC libcurlu_la-strerror.lo
CC libcurlu_la-amigaos.lo
CC libcurlu_la-hostasyn.lo
CC libcurlu_la-hostip4.lo
CC libcurlu_la-hostip6.lo
CC libcurlu_la-hostsyn.lo
CC libcurlu_la-inet_ntop.lo
CC libcurlu_la-parsedate.lo
CC libcurlu_la-select.lo
CC libcurlu_la-tftp.lo
CC libcurlu_la-splay.lo
CC libcurlu_la-strdup.lo
CC libcurlu_la-socks.lo
CC libcurlu_la-ssh.lo
CC libcurlu_la-ssh-libssh.lo
CC libcurlu_la-curl_addrinfo.lo
CC libcurlu_la-socks_gssapi.lo
CC libcurlu_la-socks_sspi.lo
CC libcurlu_la-curl_sspi.lo
CC libcurlu_la-slist.lo
CC libcurlu_la-nonblock.lo
CC libcurlu_la-curl_memrchr.lo
CC libcurlu_la-imap.lo
CC libcurlu_la-pop3.lo
CC libcurlu_la-smtp.lo
CC libcurlu_la-pingpong.lo
CC libcurlu_la-rtsp.lo
CC libcurlu_la-curl_threads.lo
CC libcurlu_la-warnless.lo
CC libcurlu_la-hmac.lo
CC libcurlu_la-curl_rtmp.lo
CC libcurlu_la-openldap.lo
CC libcurlu_la-curl_gethostname.lo
CC libcurlu_la-gopher.lo
CC libcurlu_la-idn_win32.lo
CC libcurlu_la-http_proxy.lo
CC libcurlu_la-non-ascii.lo
CC libcurlu_la-asyn-ares.lo
CC libcurlu_la-asyn-thread.lo
CC libcurlu_la-curl_gssapi.lo
CC libcurlu_la-http_ntlm.lo
CC libcurlu_la-curl_ntlm_wb.lo
CC libcurlu_la-curl_ntlm_core.lo
CC libcurlu_la-curl_sasl.lo
CC libcurlu_la-rand.lo
CC libcurlu_la-curl_multibyte.lo
CC libcurlu_la-hostcheck.lo
CC libcurlu_la-conncache.lo
CC libcurlu_la-pipeline.lo
CC libcurlu_la-dotdot.lo
CC libcurlu_la-x509asn1.lo
CC libcurlu_la-http2.lo
CC libcurlu_la-smb.lo
CC libcurlu_la-curl_endian.lo
CC libcurlu_la-curl_des.lo
CC libcurlu_la-system_win32.lo
CC libcurlu_la-mime.lo
CC libcurlu_la-sha256.lo
CC libcurlu_la-setopt.lo
CC libcurlu_la-curl_path.lo
CC libcurlu_la-curl_ctype.lo
CC libcurlu_la-curl_range.lo
CC libcurlu_la-psl.lo
CC libcurlu_la-doh.lo
CC libcurlu_la-urlapi.lo
CC vauth/libcurlu_la-vauth.lo
CC vauth/libcurlu_la-cleartext.lo
CC vauth/libcurlu_la-cram.lo
CC vauth/libcurlu_la-digest.lo
CC vauth/libcurlu_la-digest_sspi.lo
CC vauth/libcurlu_la-krb5_gssapi.lo
CC vauth/libcurlu_la-krb5_sspi.lo
CC vauth/libcurlu_la-ntlm.lo
CC vauth/libcurlu_la-ntlm_sspi.lo
CC vauth/libcurlu_la-oauth2.lo
CC vauth/libcurlu_la-spnego_gssapi.lo
CC vauth/libcurlu_la-spnego_sspi.lo
CC vtls/libcurlu_la-openssl.lo
CC vtls/libcurlu_la-gtls.lo
CC vtls/libcurlu_la-vtls.lo
CC vtls/libcurlu_la-nss.lo
CC vtls/libcurlu_la-polarssl.lo
CC vtls/libcurlu_la-polarssl_threadlock.lo
CC vtls/libcurlu_la-cyassl.lo
CC vtls/libcurlu_la-schannel.lo
CC vtls/libcurlu_la-schannel_verify.lo
CC vtls/libcurlu_la-darwinssl.lo
CC vtls/libcurlu_la-gskit.lo
CC vtls/libcurlu_la-mbedtls.lo
CC vtls/libcurlu_la-mesalink.lo
/usr/bin/perl /home/autobuild/curl/curl.git/lib/checksrc.pl -D/home/autobuild/curl/curl.git/lib -W/home/autobuild/curl/curl.git/lib/curl_config.h \
/home/autobuild/curl/curl.git/lib/*.[ch] /home/autobuild/curl/curl.git/lib/vauth/*.[ch] /home/autobuild/curl/curl.git/lib/vtls/*.[ch]
CC vauth/libcurl_la-vauth.lo
CC vauth/libcurl_la-cleartext.lo
CC vauth/libcurl_la-cram.lo
CC vauth/libcurl_la-digest.lo
CC vauth/libcurl_la-digest_sspi.lo
CC vauth/libcurl_la-krb5_gssapi.lo
CC vauth/libcurl_la-krb5_sspi.lo
CC vauth/libcurl_la-ntlm.lo
CC vauth/libcurl_la-ntlm_sspi.lo
CC vauth/libcurl_la-oauth2.lo
CC vauth/libcurl_la-spnego_gssapi.lo
CC vauth/libcurl_la-spnego_sspi.lo
CC vtls/libcurl_la-openssl.lo
CC vtls/libcurl_la-gtls.lo
CC vtls/libcurl_la-vtls.lo
CC vtls/libcurl_la-nss.lo
CC vtls/libcurl_la-polarssl.lo
CC vtls/libcurl_la-polarssl_threadlock.lo
CC vtls/libcurl_la-cyassl.lo
CC vtls/libcurl_la-schannel.lo
CC vtls/libcurl_la-schannel_verify.lo
CC vtls/libcurl_la-darwinssl.lo
CC vtls/libcurl_la-gskit.lo
CC vtls/libcurl_la-mbedtls.lo
CC vtls/libcurl_la-mesalink.lo
CCLD libcurlu.la
CCLD libcurl.la
gmake[2]: Leaving directory '/build-2737/lib'
gmake[1]: Leaving directory '/build-2737/lib'
Making all in src
gmake[1]: Entering directory '/build-2737/src'
Making all in ../docs
gmake[2]: Entering directory '/build-2737/docs'
Making all in .
gmake[3]: Entering directory '/build-2737/docs'
if test "..x" != "/home/autobuild/curl/curl.gitx" -a -e "/home/autobuild/curl/curl.git/docs/curl.1"; then \
cp -fp "/home/autobuild/curl/curl.git/docs/curl.1" /build-2737/docs/curl.1; fi
cd cmdline-opts && gmake
gmake[4]: Entering directory '/build-2737/docs/cmdline-opts'
/usr/bin/perl /home/autobuild/curl/curl.git/docs/cmdline-opts/gen.pl mainpage /home/autobuild/curl/curl.git/docs/cmdline-opts > ../../docs/curl.1
gmake[4]: Leaving directory '/build-2737/docs/cmdline-opts'
gmake[3]: Leaving directory '/build-2737/docs'
Making all in cmdline-opts
gmake[3]: Entering directory '/build-2737/docs/cmdline-opts'
gmake[3]: Nothing to be done for 'all'.
gmake[3]: Leaving directory '/build-2737/docs/cmdline-opts'
gmake[2]: Leaving directory '/build-2737/docs'
gmake[2]: Entering directory '/build-2737/src'
CC libcurltool_la-slist_wc.lo
CC libcurltool_la-tool_binmode.lo
CC libcurltool_la-tool_bname.lo
CC libcurltool_la-tool_cb_dbg.lo
CC libcurltool_la-tool_cb_hdr.lo
CC libcurltool_la-tool_cb_prg.lo
CC libcurltool_la-tool_cb_rea.lo
CC libcurltool_la-tool_cb_see.lo
CC libcurltool_la-tool_cb_wrt.lo
CC libcurltool_la-tool_cfgable.lo
CC libcurltool_la-tool_convert.lo
CC libcurltool_la-tool_dirhie.lo
CC libcurltool_la-tool_doswin.lo
CC libcurltool_la-tool_easysrc.lo
CC libcurltool_la-tool_filetime.lo
CC libcurltool_la-tool_formparse.lo
CC libcurltool_la-tool_getparam.lo
CC libcurltool_la-tool_getpass.lo
CC libcurltool_la-tool_help.lo
CC libcurltool_la-tool_helpers.lo
CC libcurltool_la-tool_homedir.lo
echo '#include "tool_setup.h"' > tool_hugehelp.c
echo '#ifndef HAVE_LIBZ' >> tool_hugehelp.c
env LC_ALL=C /usr/bin/nroff -man /build-2737/docs/curl.1 | /usr/bin/perl /home/autobuild/curl/curl.git/src/mkhelp.pl /home/autobuild/curl/curl.git/docs/MANUAL >> tool_hugehelp.c
echo '#else' >> tool_hugehelp.c
env LC_ALL=C /usr/bin/nroff -man /build-2737/docs/curl.1 | /usr/bin/perl /home/autobuild/curl/curl.git/src/mkhelp.pl -c /home/autobuild/curl/curl.git/docs/MANUAL >> tool_hugehelp.c
CC libcurltool_la-tool_libinfo.lo
echo '#endif /* HAVE_LIBZ */' >> tool_hugehelp.c
CC libcurltool_la-tool_main.lo
CC libcurltool_la-tool_metalink.lo
CC libcurltool_la-tool_msgs.lo
CC libcurltool_la-tool_operate.lo
CC libcurltool_la-tool_operhlp.lo
CC libcurltool_la-tool_panykey.lo
CC libcurltool_la-tool_paramhlp.lo
CC libcurltool_la-tool_parsecfg.lo
CC libcurltool_la-tool_strdup.lo
CC libcurltool_la-tool_setopt.lo
CC libcurltool_la-tool_sleep.lo
CC libcurltool_la-tool_urlglob.lo
CC libcurltool_la-tool_util.lo
CC libcurltool_la-tool_vms.lo
CC libcurltool_la-tool_writeout.lo
CC libcurltool_la-tool_xattr.lo
CC curl-slist_wc.o
CC curl-tool_binmode.o
CC curl-tool_bname.o
CC curl-tool_cb_dbg.o
CC curl-tool_cb_hdr.o
CC curl-tool_cb_prg.o
CC curl-tool_cb_rea.o
CC curl-tool_cb_see.o
CC curl-tool_cb_wrt.o
CC curl-tool_cfgable.o
CC curl-tool_convert.o
CC curl-tool_dirhie.o
CC curl-tool_doswin.o
CC curl-tool_easysrc.o
CC curl-tool_filetime.o
CC curl-tool_formparse.o
CC curl-tool_getparam.o
CC curl-tool_getpass.o
CC curl-tool_help.o
CC curl-tool_helpers.o
CC curl-tool_homedir.o
CC curl-tool_hugehelp.o
CC curl-tool_libinfo.o
CC curl-tool_main.o
CC curl-tool_metalink.o
CC curl-tool_msgs.o
CC curl-tool_operate.o
CC curl-tool_operhlp.o
CC curl-tool_panykey.o
CC curl-tool_paramhlp.o
CC curl-tool_parsecfg.o
CC curl-tool_strdup.o
CC curl-tool_setopt.o
CC curl-tool_sleep.o
CC curl-tool_urlglob.o
CC curl-tool_util.o
CC curl-tool_vms.o
CC curl-tool_writeout.o
CC curl-tool_xattr.o
CC ../lib/curl-strtoofft.o
CC ../lib/curl-nonblock.o
CC ../lib/curl-warnless.o
CC ../lib/curl-curl_ctype.o
/usr/bin/perl /home/autobuild/curl/curl.git/lib/checksrc.pl -D/home/autobuild/curl/curl.git/src \
-W/home/autobuild/curl/curl.git/src/tool_hugehelp.c /home/autobuild/curl/curl.git/src/*.[ch]
CC libcurltool_la-tool_hugehelp.lo
CC ../lib/libcurltool_la-strtoofft.lo
CC ../lib/libcurltool_la-nonblock.lo
CC ../lib/libcurltool_la-warnless.lo
CC ../lib/libcurltool_la-curl_ctype.lo
CCLD curl
CCLD libcurltool.la
gmake[2]: Leaving directory '/build-2737/src'
gmake[1]: Leaving directory '/build-2737/src'
gmake[1]: Entering directory '/build-2737'
gmake[1]: Nothing to be done for 'all-am'.
gmake[1]: Leaving directory '/build-2737'
testcurl: libcurl was created fine (libcurl.la)
testcurl: curl was created fine (curl)
testcurl: display curl --version output
curl 7.64.0-DEV (i686-pc-linux-gnu) libcurl/7.64.0-DEV OpenSSL/1.0.2q zlib/1.2.11 libssh2/1.8.0
Release-Date: [unreleased]
Protocols: dict file ftp ftps gopher http https imap imaps pop3 pop3s rtsp scp sftp smb smbs smtp smtps telnet tftp
Features: AsynchDNS Debug TrackMemory IPv6 Largefile NTLM NTLM_WB SSL libz TLS-SRP UnixSockets HTTPS-proxy
testcurl: gmake -k TEST_F="-a -n -p !proxy !HTTP\ proxy !proxytunnel !SOCKS4 !SOCKS5" test-full
gmake[1]: Entering directory '/build-2737/tests'
Making all in certs
gmake[2]: Entering directory '/build-2737/tests/certs'
Making all in scripts
gmake[3]: Entering directory '/build-2737/tests/certs/scripts'
gmake[3]: Nothing to be done for 'all'.
gmake[3]: Leaving directory '/build-2737/tests/certs/scripts'
gmake[3]: Entering directory '/build-2737/tests/certs'
gmake[3]: Nothing to be done for 'all-am'.
gmake[3]: Leaving directory '/build-2737/tests/certs'
gmake[2]: Leaving directory '/build-2737/tests/certs'
Making all in data
gmake[2]: Entering directory '/build-2737/tests/data'
gmake[2]: Nothing to be done for 'all'.
gmake[2]: Leaving directory '/build-2737/tests/data'
Making all in server
gmake[2]: Entering directory '/build-2737/tests/server'
CC ../../lib/getpart-mprintf.o
CC ../../lib/getpart-nonblock.o
CC ../../lib/getpart-strtoofft.o
CC ../../lib/getpart-warnless.o
CC ../../lib/getpart-curl_ctype.o
CC getpart-getpart.o
CC ../../lib/getpart-base64.o
CC ../../lib/getpart-memdebug.o
CC getpart-testpart.o
CC ../../lib/resolve-mprintf.o
CC ../../lib/resolve-nonblock.o
CC ../../lib/resolve-strtoofft.o
CC ../../lib/resolve-warnless.o
CC ../../lib/resolve-curl_ctype.o
CC resolve-getpart.o
CC ../../lib/resolve-base64.o
CC ../../lib/resolve-memdebug.o
CC resolve-util.o
CC resolve-resolve.o
CC ../../lib/rtspd-mprintf.o
CC ../../lib/rtspd-nonblock.o
CC ../../lib/rtspd-strtoofft.o
CC ../../lib/rtspd-warnless.o
CC ../../lib/rtspd-curl_ctype.o
CC rtspd-getpart.o
CC ../../lib/rtspd-base64.o
CC ../../lib/rtspd-memdebug.o
CC rtspd-util.o
CC rtspd-rtspd.o
CC ../../lib/sockfilt-mprintf.o
CC ../../lib/sockfilt-nonblock.o
CC ../../lib/sockfilt-strtoofft.o
CC ../../lib/sockfilt-warnless.o
CC ../../lib/sockfilt-curl_ctype.o
CC sockfilt-getpart.o
CC ../../lib/sockfilt-base64.o
CC ../../lib/sockfilt-memdebug.o
CC sockfilt-util.o
CC sockfilt-sockfilt.o
CC ../../lib/sockfilt-inet_pton.o
CC ../../lib/sws-mprintf.o
CC ../../lib/sws-nonblock.o
CC ../../lib/sws-strtoofft.o
CC ../../lib/sws-warnless.o
CC ../../lib/sws-curl_ctype.o
CC sws-getpart.o
CC ../../lib/sws-base64.o
CC ../../lib/sws-memdebug.o
CC sws-util.o
CC sws-sws.o
CC ../../lib/sws-inet_pton.o
CC ../../lib/tftpd-mprintf.o
CC ../../lib/tftpd-nonblock.o
CC ../../lib/tftpd-strtoofft.o
CC ../../lib/tftpd-warnless.o
CC ../../lib/tftpd-curl_ctype.o
CC tftpd-getpart.o
CC ../../lib/tftpd-base64.o
CC ../../lib/tftpd-memdebug.o
CC tftpd-util.o
CC tftpd-tftpd.o
CC ../../lib/fake_ntlm-mprintf.o
CC ../../lib/fake_ntlm-nonblock.o
CC ../../lib/fake_ntlm-strtoofft.o
CC ../../lib/fake_ntlm-warnless.o
CC ../../lib/fake_ntlm-curl_ctype.o
CC fake_ntlm-getpart.o
CC ../../lib/fake_ntlm-base64.o
CC ../../lib/fake_ntlm-memdebug.o
CC fake_ntlm-util.o
CC fake_ntlm-fake_ntlm.o
/usr/bin/perl /home/autobuild/curl/curl.git/lib/checksrc.pl /home/autobuild/curl/curl.git/tests/server/*.c
CCLD getpart
CCLD resolve
CCLD rtspd
CCLD sockfilt
CCLD sws
CCLD tftpd
CCLD fake_ntlm
gmake[2]: Leaving directory '/build-2737/tests/server'
Making all in libtest
gmake[2]: Entering directory '/build-2737/tests/libtest'
CC chkhostname-chkhostname.o
CC libhostname_la-sethostname.lo
CC ../../lib/chkhostname-curl_gethostname.o
CC libauthretry-libauthretry.o
CC libauthretry-first.o
CC libntlmconnect-libntlmconnect.o
CC libntlmconnect-first.o
CC libntlmconnect-testutil.o
CC ../../lib/libntlmconnect-warnless.o
CC chkdecimalpoint-chkdecimalpoint.o
CC ../../lib/chkdecimalpoint-mprintf.o
CC ../../lib/chkdecimalpoint-curl_ctype.o
CC lib500-lib500.o
CC lib500-first.o
CC lib500-testutil.o
CC lib500-testtrace.o
CC lib501-lib501.o
CC lib501-first.o
CC lib502-lib502.o
CC lib502-first.o
CC lib502-testutil.o
CC ../../lib/lib502-warnless.o
CC lib503-lib503.o
CC lib503-first.o
CC lib503-testutil.o
CC ../../lib/lib503-warnless.o
CC lib504-lib504.o
CC lib504-first.o
CC lib504-testutil.o
CC ../../lib/lib504-warnless.o
CC lib505-lib505.o
CC lib505-first.o
CC lib506-lib506.o
CC lib506-first.o
CC lib507-lib507.o
CC lib507-first.o
CC lib507-testutil.o
CC ../../lib/lib507-warnless.o
CC lib508-lib508.o
CC lib508-first.o
CC lib509-lib509.o
CC lib509-first.o
CC lib510-lib510.o
CC lib510-first.o
CC lib511-lib511.o
CC lib511-first.o
CC lib512-lib512.o
CC lib512-first.o
CC lib513-first.o
CC lib513-lib513.o
CC lib514-lib514.o
CC lib514-first.o
CC lib515-lib515.o
CC lib515-first.o
CC lib516-lib516.o
CC lib516-first.o
CC lib517-lib517.o
CC lib517-first.o
CC lib518-lib518.o
CC lib518-first.o
CC ../../lib/lib518-warnless.o
CC lib519-lib519.o
CC lib519-first.o
CC lib520-lib520.o
CC lib520-first.o
CC lib521-lib521.o
CC lib521-first.o
CC lib523-lib523.o
CC lib523-first.o
CC lib524-lib524.o
CC lib524-first.o
CC lib525-lib525.o
CC lib525-first.o
CC lib525-testutil.o
CC ../../lib/lib525-warnless.o
CC lib526-lib526.o
CC lib526-first.o
CC lib526-testutil.o
CC ../../lib/lib526-warnless.o
CC lib527-lib526.o
CC lib527-first.o
CC lib527-testutil.o
CC ../../lib/lib527-warnless.o
CC lib529-lib525.o
CC lib529-first.o
CC lib529-testutil.o
CC ../../lib/lib529-warnless.o
CC lib530-lib530.o
CC lib530-first.o
CC lib530-testutil.o
CC ../../lib/lib530-warnless.o
CC lib532-lib526.o
CC lib532-first.o
CC lib532-testutil.o
CC ../../lib/lib532-warnless.o
CC lib533-lib533.o
CC lib533-first.o
CC lib533-testutil.o
CC ../../lib/lib533-warnless.o
CC lib536-lib536.o
CC lib536-first.o
CC lib536-testutil.o
CC ../../lib/lib536-warnless.o
CC lib537-lib537.o
CC lib537-first.o
CC ../../lib/lib537-warnless.o
CC lib539-lib539.o
CC lib539-first.o
CC lib540-lib540.o
CC lib540-first.o
CC lib540-testutil.o
CC ../../lib/lib540-warnless.o
CC lib541-lib541.o
CC lib541-first.o
CC lib542-lib542.o
CC lib542-first.o
CC lib543-lib543.o
CC lib543-first.o
CC lib544-lib544.o
CC lib544-first.o
CC lib545-lib544.o
CC lib545-first.o
CC lib547-lib547.o
CC lib547-first.o
CC lib548-lib547.o
CC lib548-first.o
CC lib549-lib549.o
CC lib549-first.o
CC lib552-lib552.o
CC lib552-first.o
CC ../../lib/lib552-warnless.o
CC lib553-lib553.o
CC lib553-first.o
CC lib554-lib554.o
CC lib554-first.o
CC lib555-lib555.o
CC lib555-first.o
CC lib555-testutil.o
CC ../../lib/lib555-warnless.o
CC lib556-lib556.o
CC lib556-first.o
CC ../../lib/lib556-warnless.o
CC lib557-lib557.o
CC lib557-first.o
CC lib558-lib558.o
CC lib558-first.o
CC lib559-lib559.o
CC lib559-first.o
CC lib560-lib560.o
CC lib560-first.o
CC lib560-testutil.o
CC ../../lib/lib560-warnless.o
CC lib562-lib562.o
CC lib562-first.o
CC lib564-lib564.o
CC lib564-first.o
CC lib564-testutil.o
CC ../../lib/lib564-warnless.o
CC lib565-lib510.o
CC lib565-first.o
CC lib566-lib566.o
CC lib566-first.o
CC lib567-lib567.o
CC lib567-first.o
CC lib568-lib568.o
CC lib568-first.o
CC lib569-lib569.o
CC lib569-first.o
CC lib570-lib570.o
CC lib570-first.o
CC lib571-lib571.o
CC lib571-first.o
CC ../../lib/lib571-warnless.o
CC lib572-lib572.o
CC lib572-first.o
CC lib573-lib573.o
CC lib573-first.o
CC lib573-testutil.o
CC ../../lib/lib573-warnless.o
CC lib573-testtrace.o
CC lib574-lib574.o
CC lib574-first.o
CC lib575-lib575.o
CC lib575-first.o
CC lib575-testutil.o
CC ../../lib/lib575-warnless.o
CC lib576-lib576.o
CC lib576-first.o
CC lib578-lib578.o
CC lib578-first.o
CC lib579-lib579.o
CC lib579-first.o
CC lib582-lib582.o
CC lib582-first.o
CC lib582-testutil.o
CC ../../lib/lib582-warnless.o
CC lib583-lib583.o
CC lib583-first.o
CC lib585-lib500.o
CC lib585-first.o
CC lib585-testutil.o
CC lib585-testtrace.o
CC lib586-lib586.o
CC lib586-first.o
CC lib587-lib554.o
CC lib587-first.o
CC lib589-lib589.o
CC lib589-first.o
CC lib590-lib590.o
CC lib590-first.o
CC lib591-lib591.o
CC lib591-first.o
CC lib591-testutil.o
CC ../../lib/lib591-warnless.o
CC lib597-lib597.o
CC lib597-first.o
CC lib597-testutil.o
CC ../../lib/lib597-warnless.o
CC lib598-lib598.o
CC lib598-first.o
CC lib599-lib599.o
CC lib599-first.o
CC lib643-lib643.o
CC lib643-first.o
CC lib644-lib643.o
CC lib644-first.o
CC lib645-lib643.o
CC lib645-first.o
CC lib650-lib650.o
CC lib650-first.o
CC lib651-lib651.o
CC lib651-first.o
CC lib652-lib652.o
CC lib652-first.o
CC lib653-lib653.o
CC lib653-first.o
CC lib654-lib654.o
CC lib654-first.o
CC lib655-lib655.o
CC lib655-first.o
CC lib658-lib658.o
CC lib658-first.o
CC lib658-testutil.o
CC ../../lib/lib658-warnless.o
CC lib1156-lib1156.o
CC lib1156-first.o
CC lib1156-testutil.o
CC ../../lib/lib1156-warnless.o
CC lib1500-lib1500.o
CC lib1500-first.o
CC lib1500-testutil.o
CC lib1501-lib1501.o
CC lib1501-first.o
CC lib1501-testutil.o
CC ../../lib/lib1501-warnless.o
CC lib1502-lib1502.o
CC lib1502-first.o
CC lib1502-testutil.o
CC ../../lib/lib1502-warnless.o
CC lib1503-lib1502.o
CC lib1503-first.o
CC lib1503-testutil.o
CC ../../lib/lib1503-warnless.o
CC lib1504-lib1502.o
CC lib1504-first.o
CC lib1504-testutil.o
CC ../../lib/lib1504-warnless.o
CC lib1505-lib1502.o
CC lib1505-first.o
CC lib1505-testutil.o
CC ../../lib/lib1505-warnless.o
CC lib1506-lib1506.o
CC lib1506-first.o
CC lib1506-testutil.o
CC ../../lib/lib1506-warnless.o
CC lib1507-lib1507.o
CC lib1507-first.o
CC lib1507-testutil.o
CC ../../lib/lib1507-warnless.o
CC lib1508-lib1508.o
CC lib1508-first.o
CC lib1508-testutil.o
CC ../../lib/lib1508-warnless.o
CC lib1509-lib1509.o
CC lib1509-first.o
CC lib1509-testutil.o
CC ../../lib/lib1509-warnless.o
CC lib1510-lib1510.o
CC lib1510-first.o
CC lib1510-testutil.o
CC ../../lib/lib1510-warnless.o
CC lib1511-lib1511.o
CC lib1511-first.o
CC lib1511-testutil.o
CC ../../lib/lib1511-warnless.o
CC lib1512-lib1512.o
CC lib1512-first.o
CC lib1512-testutil.o
CC ../../lib/lib1512-warnless.o
CC lib1513-lib1513.o
CC lib1513-first.o
CC lib1513-testutil.o
CC ../../lib/lib1513-warnless.o
CC lib1514-lib1514.o
CC lib1514-first.o
CC lib1514-testutil.o
CC ../../lib/lib1514-warnless.o
CC lib1515-lib1515.o
CC lib1515-first.o
CC lib1515-testutil.o
CC ../../lib/lib1515-warnless.o
CC lib1517-lib1517.o
CC lib1517-first.o
CC lib1518-lib1518.o
CC lib1518-first.o
CC lib1520-lib1520.o
CC lib1520-first.o
/usr/bin/perl /home/autobuild/curl/curl.git/tests/libtest/mk-lib1521.pl < /home/autobuild/curl/curl.git/include/curl/curl.h > lib1521.c
CC lib1521-first.o
CC lib1522-lib1522.o
CC lib1522-first.o
CC lib1525-lib1525.o
CC lib1525-first.o
CC lib1525-testutil.o
CC ../../lib/lib1525-warnless.o
CC lib1526-lib1526.o
CC lib1526-first.o
CC lib1526-testutil.o
CC ../../lib/lib1526-warnless.o
CC lib1527-lib1527.o
CC lib1527-first.o
CC lib1527-testutil.o
CC ../../lib/lib1527-warnless.o
CC lib1528-lib1528.o
CC lib1528-first.o
CC lib1528-testutil.o
CC ../../lib/lib1528-warnless.o
CC lib1529-lib1529.o
CC lib1529-first.o
CC lib1529-testutil.o
CC ../../lib/lib1529-warnless.o
CC lib1530-lib1530.o
CC lib1530-first.o
CC lib1530-testutil.o
CC ../../lib/lib1530-warnless.o
CC lib1531-lib1531.o
CC lib1531-first.o
CC lib1531-testutil.o
CC ../../lib/lib1531-warnless.o
CC lib1532-lib1532.o
CC lib1532-first.o
CC lib1532-testutil.o
CC ../../lib/lib1532-warnless.o
CC lib1533-lib1533.o
CC lib1533-first.o
CC lib1533-testutil.o
CC ../../lib/lib1533-warnless.o
CC lib1534-lib1534.o
CC lib1534-first.o
CC lib1534-testutil.o
CC ../../lib/lib1534-warnless.o
CC lib1535-lib1535.o
CC lib1535-first.o
CC lib1535-testutil.o
CC ../../lib/lib1535-warnless.o
CC lib1536-lib1536.o
CC lib1536-first.o
CC lib1536-testutil.o
CC ../../lib/lib1536-warnless.o
CC lib1537-lib1537.o
CC lib1537-first.o
CC lib1537-testutil.o
CC ../../lib/lib1537-warnless.o
CC lib1538-lib1538.o
CC lib1538-first.o
CC lib1538-testutil.o
CC ../../lib/lib1538-warnless.o
CC lib1540-lib1540.o
CC lib1540-first.o
CC lib1540-testutil.o
CC ../../lib/lib1540-warnless.o
CC lib1550-lib1550.o
CC lib1550-first.o
CC lib1551-lib1551.o
CC lib1551-first.o
CC lib1552-lib1552.o
CC lib1552-first.o
CC lib1552-testutil.o
CC lib1553-lib1553.o
CC lib1553-first.o
CC lib1553-testutil.o
CC lib1554-lib1554.o
CC lib1554-first.o
CC lib1555-lib1555.o
CC lib1555-first.o
CC lib1555-testutil.o
CC ../../lib/lib1555-warnless.o
CC lib1556-lib1556.o
CC lib1556-first.o
CC lib1556-testutil.o
CC ../../lib/lib1556-warnless.o
CC lib1557-lib1557.o
CC lib1557-first.o
CC lib1557-testutil.o
CC ../../lib/lib1557-warnless.o
CC lib1558.o
CC first.o
CC testutil.o
CC ../../lib/warnless.o
CC lib1560.o
CC lib1591-lib1591.o
CC lib1591-first.o
CC lib1591-testutil.o
CC ../../lib/lib1591-warnless.o
CC lib1592-lib1592.o
CC lib1592-first.o
CC lib1592-testutil.o
CC ../../lib/lib1592-warnless.o
CC lib1900-lib1900.o
CC lib1900-first.o
CC lib1900-testutil.o
CC ../../lib/lib1900-warnless.o
CC lib2033-libntlmconnect.o
CC lib2033-first.o
CC lib2033-testutil.o
CC ../../lib/lib2033-warnless.o
/usr/bin/perl /home/autobuild/curl/curl.git/lib/checksrc.pl /home/autobuild/curl/curl.git/tests/libtest/*.c
CCLD libhostname.la
CCLD chkhostname
CCLD libauthretry
CCLD libntlmconnect
CCLD chkdecimalpoint
CCLD lib500
CCLD lib501
CCLD lib502
CCLD lib503
CCLD lib504
CCLD lib505
CCLD lib506
CCLD lib507
CCLD lib508
CCLD lib509
CCLD lib510
CCLD lib511
CCLD lib512
CCLD lib513
CCLD lib514
CCLD lib515
CCLD lib516
CCLD lib517
CCLD lib518
CCLD lib519
CCLD lib520
CCLD lib521
CCLD lib523
CCLD lib524
CCLD lib525
CCLD lib526
CCLD lib527
CCLD lib529
CCLD lib530
CCLD lib532
CCLD lib533
CCLD lib536
CCLD lib537
CCLD lib539
CCLD lib540
CCLD lib541
CCLD lib542
CCLD lib543
CCLD lib544
CCLD lib545
CCLD lib547
CCLD lib548
CCLD lib549
CCLD lib552
CCLD lib553
CCLD lib554
CCLD lib555
CCLD lib556
CCLD lib557
CCLD lib558
CCLD lib559
CCLD lib560
CCLD lib562
CCLD lib564
CCLD lib565
CCLD lib566
CCLD lib567
CCLD lib568
CCLD lib569
CCLD lib570
CCLD lib571
CCLD lib572
CCLD lib573
CCLD lib574
CCLD lib575
CCLD lib576
CCLD lib578
CCLD lib579
CCLD lib582
CCLD lib583
CCLD lib585
CCLD lib586
CCLD lib587
CCLD lib589
CCLD lib590
CCLD lib591
CCLD lib597
CCLD lib598
CCLD lib599
CCLD lib643
CCLD lib644
CCLD lib645
CCLD lib650
CCLD lib651
CCLD lib652
CCLD lib653
CCLD lib654
CCLD lib655
CCLD lib658
CCLD lib1156
CCLD lib1500
CCLD lib1501
CCLD lib1502
CCLD lib1503
CCLD lib1504
CCLD lib1505
CCLD lib1506
CCLD lib1507
CCLD lib1508
CCLD lib1509
CCLD lib1510
CCLD lib1511
CCLD lib1512
CCLD lib1513
CCLD lib1514
CCLD lib1515
CCLD lib1517
CCLD lib1518
CCLD lib1520
CC lib1521-lib1521.o
CCLD lib1522
CCLD lib1525
CCLD lib1526
CCLD lib1527
CCLD lib1528
CCLD lib1529
CCLD lib1530
CCLD lib1531
CCLD lib1532
CCLD lib1533
CCLD lib1534
CCLD lib1535
CCLD lib1536
CCLD lib1537
CCLD lib1538
CCLD lib1540
CCLD lib1550
CCLD lib1551
CCLD lib1552
CCLD lib1553
CCLD lib1554
CCLD lib1555
CCLD lib1556
CCLD lib1557
CCLD lib1558
CCLD lib1560
CCLD lib1591
CCLD lib1592
CCLD lib1900
CCLD lib2033
CCLD lib1521
gmake[2]: Leaving directory '/build-2737/tests/libtest'
Making all in unit
gmake[2]: Entering directory '/build-2737/tests/unit'
CC unit1300-unit1300.o
CC unit1301-unit1301.o
CC ../libtest/unit1301-first.o
CC unit1302-unit1302.o
CC ../libtest/unit1302-first.o
CC unit1303-unit1303.o
CC ../libtest/unit1303-first.o
CC unit1304-unit1304.o
CC ../libtest/unit1304-first.o
CC unit1305-unit1305.o
CC ../libtest/unit1305-first.o
CC unit1307-unit1307.o
CC ../libtest/unit1307-first.o
CC unit1308-unit1308.o
CC ../libtest/unit1308-first.o
CC unit1309-unit1309.o
CC ../libtest/unit1309-first.o
CC unit1323-unit1323.o
CC ../libtest/unit1323-first.o
CC unit1330-unit1330.o
CC ../libtest/unit1330-first.o
CC unit1394-unit1394.o
CC ../libtest/unit1394-first.o
CC unit1395-unit1395.o
CC ../libtest/unit1395-first.o
CC unit1396-unit1396.o
CC ../libtest/unit1396-first.o
CC unit1397-unit1397.o
CC ../libtest/unit1397-first.o
CC unit1398-unit1398.o
CC ../libtest/unit1398-first.o
CC unit1399-unit1399.o
CC ../libtest/unit1399-first.o
CC unit1600-unit1600.o
CC ../libtest/unit1600-first.o
CC unit1601-unit1601.o
CC ../libtest/unit1601-first.o
CC unit1602-unit1602.o
CC ../libtest/unit1602-first.o
CC unit1603-unit1603.o
CC ../libtest/unit1603-first.o
CC unit1604-unit1604.o
CC ../libtest/unit1604-first.o
CC unit1605-unit1605.o
CC ../libtest/unit1605-first.o
CC unit1606-unit1606.o
CC ../libtest/unit1606-first.o
CC unit1607-unit1607.o
CC ../libtest/unit1607-first.o
CC unit1608-unit1608.o
CC ../libtest/unit1608-first.o
CC unit1609-unit1609.o
CC ../libtest/unit1609-first.o
CC unit1620-unit1620.o
CC ../libtest/unit1620-first.o
CC unit1621-unit1621.o
CC ../libtest/unit1621-first.o
CC unit1650-unit1650.o
CC ../libtest/unit1650-first.o
CC unit1651-unit1651.o
CC ../libtest/unit1651-first.o
CC unit1652-unit1652.o
CC ../libtest/unit1652-first.o
CC unit1653-unit1653.o
CC ../libtest/unit1653-first.o
CC ../libtest/unit1300-first.o
CCLD unit1301
CCLD unit1302
CCLD unit1303
CCLD unit1304
CCLD unit1305
CCLD unit1307
CCLD unit1308
CCLD unit1309
CCLD unit1323
CCLD unit1330
CCLD unit1394
CCLD unit1395
CCLD unit1396
CCLD unit1397
CCLD unit1398
CCLD unit1399
CCLD unit1600
CCLD unit1601
CCLD unit1602
CCLD unit1603
CCLD unit1604
CCLD unit1605
CCLD unit1606
CCLD unit1607
CCLD unit1608
CCLD unit1609
CCLD unit1620
CCLD unit1621
CCLD unit1650
CCLD unit1651
CCLD unit1652
CCLD unit1653
CCLD unit1300
gmake[2]: Leaving directory '/build-2737/tests/unit'
gmake[2]: Entering directory '/build-2737/tests'
cd libtest && gmake checksrc
gmake[3]: Entering directory '/build-2737/tests/libtest'
/usr/bin/perl /home/autobuild/curl/curl.git/lib/checksrc.pl /home/autobuild/curl/curl.git/tests/libtest/*.c
gmake[3]: Leaving directory '/build-2737/tests/libtest'
cd unit && gmake checksrc
gmake[3]: Entering directory '/build-2737/tests/unit'
/usr/bin/perl /home/autobuild/curl/curl.git/lib/checksrc.pl /home/autobuild/curl/curl.git/tests/unit/*.c
gmake[3]: Leaving directory '/build-2737/tests/unit'
cd server && gmake checksrc
gmake[3]: Entering directory '/build-2737/tests/server'
/usr/bin/perl /home/autobuild/curl/curl.git/lib/checksrc.pl /home/autobuild/curl/curl.git/tests/server/*.c
gmake[3]: Leaving directory '/build-2737/tests/server'
gmake[2]: Leaving directory '/build-2737/tests'
srcdir=/home/autobuild/curl/curl.git/tests /usr/bin/perl -I/home/autobuild/curl/curl.git/tests /home/autobuild/curl/curl.git/tests/runtests.pl -a -n -p !proxy !HTTP\ proxy !proxytunnel !SOCKS4 !SOCKS5
make[2]: warning: jobserver unavailable: using -j1. Add '+' to parent make rule.
********* System characteristics ********
* curl 7.64.0-DEV (i686-pc-linux-gnu)
* libcurl/7.64.0-DEV OpenSSL/1.0.2q zlib/1.2.11 libssh2/1.8.0
* Features: AsynchDNS Debug TrackMemory IPv6 Largefile NTLM NTLM_WB SSL libz TLS-SRP UnixSockets HTTPS-proxy
* Host: autobuild
* System: Linux autobuild 4.14.89-server-1.mga6 #1 SMP Mon Dec 17 16:09:25 UTC 2018 i686 i686 i686 GNU/Linux
*
*** DISABLES memory tracking when using threaded resolver
*
* Servers: SSL HTTP-IPv6 HTTP-unix FTP-IPv6
* Env:
*****************************************
test 0001...[HTTP GET]
-pd---e--- OK (1 out of 1217, remaining: 41:57)
test 0002...[HTTP GET with user and password]
-pd---e--- OK (2 out of 1217, remaining: 21:50)
test 0003...[HTTP POST with auth and contents but with content-length set to 0]
-pd---e--- OK (3 out of 1217, remaining: 14:48)
test 0004...[Replaced internal and added custom HTTP headers]
-pd---e--- OK (4 out of 1217, remaining: 11:47)
test 0005 SKIPPED: disabled by keyword
test 0006...[HTTP with simple cookie send]
-pd---e--- OK (6 out of 1217, remaining: 08:08)
test 0007...[HTTP with cookie parser and header recording]
-pd--oe--- OK (7 out of 1217, remaining: 07:13)
test 0008...[HTTP with cookie parsing from header file]
-pd---e--- OK (8 out of 1217, remaining: 06:33)
test 0009...[HTTP RFC1867-type formposting]
-pd---e--- OK (9 out of 1217, remaining: 06:01)
test 0010...[simple HTTP PUT from file]
-pd---e--- OK (10 out of 1217, remaining: 07:36)
test 0011...[simple HTTP Location: following]
-pd---e--- OK (11 out of 1217, remaining: 07:09)
test 0012...[HTTP range support]
-pd---e--- OK (12 out of 1217, remaining: 06:37)
test 0013...[HTTP custom request 'DELETE']
-pd---e--- OK (13 out of 1217, remaining: 06:09)
test 0014...[HTTP HEAD with Connection: close]
-pd---e--- OK (14 out of 1217, remaining: 05:45)
test 0015...[--write-out test]
sp----e--- OK (15 out of 1217, remaining: 05:24)
test 0016 SKIPPED: disabled by keyword
test 0017...[HTTP with config file on stdin]
-pd---e--- OK (17 out of 1217, remaining: 04:48)
test 0018...[multiple requests using {} in URL]
sp----e--- OK (18 out of 1217, remaining: 04:35)
test 0019...[attempt connect to non-listening socket]
------e--- OK (19 out of 1217, remaining: 04:22)
test 0020...[attempt connect to non-existing host name]
------e--- OK (20 out of 1217, remaining: 04:11)
test 0021...[use curl with multiple request methods]
------e--- OK (21 out of 1217, remaining: 04:01)
test 0022...[get HTTP with URL > 10000 bytes]
-pd---e--- OK (22 out of 1217, remaining: 03:52)
test 0023...[unsupported protocol:// URL]
------e--- OK (23 out of 1217, remaining: 03:43)
test 0024...[HTTP GET fail silently on HTTP error return]
-p---oe--- OK (24 out of 1217, remaining: 03:35)
test 0025...[looping HTTP Location: following with --max-redirs]
-pd---e--- OK (25 out of 1217, remaining: 03:29)
test 0026...[specify more -o than URLs]
-pd---e--- OK (26 out of 1217, remaining: 03:24)
test 0027...[Get same cookie page several times]
-pd---e--- OK (27 out of 1217, remaining: 03:25)
test 0028...[HTTP Location: following with extra spaces in header]
-pd---e--- OK (28 out of 1217, remaining: 03:23)
test 0029...[HTTP with 2 secs timeout]
-pd---e--- OK (29 out of 1217, remaining: 10:11)
test 0030...[HTTP with no data in server reply]
-p----e--- OK (30 out of 1217, remaining: 09:53)
test 0031...[HTTP with weirdly formatted cookies and cookiejar storage]
-pd--oe--- OK (31 out of 1217, remaining: 09:36)
test 0032...[HTTP with -d and -G]
-pd---e--- OK (32 out of 1217, remaining: 09:18)
test 0033...[HTTP PUT with resume]
-pd---e--- OK (33 out of 1217, remaining: 09:40)
test 0034...[HTTP GET with chunked Transfer-Encoding]
-pd---e--- OK (34 out of 1217, remaining: 09:24)
test 0035...[HTTP POST binary data with embedded NUL]
-pd---e--- OK (35 out of 1217, remaining: 09:10)
test 0036...[HTTP GET with bad chunked Transfer-Encoding]
-pd---e--- OK (36 out of 1217, remaining: 08:55)
test 0037...[HTTP GET with nothing returned from server]
-p----e--- OK (37 out of 1217, remaining: 08:43)
test 0038...[HTTP resume request without server supporting it]
-p---oe--- OK (38 out of 1217, remaining: 08:30)
test 0039...[HTTP RFC1867-type formposting with filename= and type=]
-pd---e--- OK (39 out of 1217, remaining: 08:48)
test 0040...[HTTP redirect with whitespace after ? (and conversion)]
-pd---e--- OK (40 out of 1217, remaining: 08:39)
test 0041...[HTTP formpost with missing file]
------e--- OK (41 out of 1217, remaining: 08:55)
test 0042...[HTTP redirect with whitespace in path (and conversion)]
-pd---e--- OK (42 out of 1217, remaining: 08:46)
test 0043 SKIPPED: disabled by keyword
test 0044...[HTTP RFC1867-type formposting without Expect: header]
-pd---e--- OK (44 out of 1217, remaining: 08:23)
test 0045...[simple HTTP Location: without protocol in initial URL]
-pd---e--- OK (45 out of 1217, remaining: 08:15)
test 0046...[HTTP with bad domain name, get cookies and store in cookie jar]
-pd--oe--- OK (46 out of 1217, remaining: 08:05)
test 0047...[simple HTTP 1.0 GET]
-pd---e--- OK (47 out of 1217, remaining: 07:56)
test 0048...[HTTP with -d and -G and -I]
-pd---e--- OK (48 out of 1217, remaining: 07:47)
test 0049...[HTTP follow redirect with ../]
-pd---e--- OK (49 out of 1217, remaining: 07:40)
test 0050...[HTTP follow redirect with ../../]
-pd---e--- OK (50 out of 1217, remaining: 07:34)
test 0051...[HTTP follow redirect with excessive ../]
-pd---e--- OK (51 out of 1217, remaining: 07:28)
test 0052...[HTTP follow redirect with ./-prefix]
-pd---e--- OK (52 out of 1217, remaining: 07:22)
test 0053...[HTTP, junk session cookies]
-pd---e--- OK (53 out of 1217, remaining: 07:14)
test 0054...[HTTP with blank Location:]
-pd---e--- OK (54 out of 1217, remaining: 07:07)
test 0055...[HTTP follow redirect with single slash in path]
-pd---e--- OK (55 out of 1217, remaining: 07:02)
test 0056...[HTTP POST with *HUGE* request and chunked transfer-encoding]
-pd---e--- OK (56 out of 1217, remaining: 06:56)
test 0057...[HTTP content-type with spaces in]
sp----e--- OK (57 out of 1217, remaining: 06:50)
test 0058...[HTTP PUT from file with weird letters]
-pd---e--- OK (58 out of 1217, remaining: 07:05)
test 0059...[HTTP URL with slash but with "parameter"]
-pd---e--- OK (59 out of 1217, remaining: 06:59)
test 0060...[HTTP PUT from stdin with wrong content-length]
-pd---e--- OK (60 out of 1217, remaining: 07:13)
test 0061...[HTTP with various cookies and custom Host:]
-pd--oe--- OK (61 out of 1217, remaining: 07:06)
test 0062...[HTTP, send cookies when using custom Host:]
-pd---e--- OK (62 out of 1217, remaining: 07:00)
test 0064...[HTTP with Digest authorization]
-pd---e--- OK (64 out of 1217, remaining: 06:49)
test 0065...[HTTP with Digest authorization with bad password]
-pd---e--- OK (65 out of 1217, remaining: 06:43)
test 0066...[HTTP GET without headers in the response]
-pd---e--- OK (66 out of 1217, remaining: 06:38)
test 0067...[HTTP with NTLM authorization]
-pd---e--- OK (67 out of 1217, remaining: 06:33)
test 0068...[HTTP with NTLM authorization and wrong password]
-pd---e--- OK (68 out of 1217, remaining: 06:28)
test 0069...[HTTP with NTLM, Basic or Wild-and-crazy authorization]
-pd---e--- OK (69 out of 1217, remaining: 06:25)
test 0070...[HTTP with Digest *OR* NTLM authorization]
-pd---e--- OK (70 out of 1217, remaining: 06:19)
test 0071...[HTTP and -F upload in config file]
-pd---e--- OK (71 out of 1217, remaining: 06:15)
test 0072...[HTTP with Digest *OR* Basic authorization]
-pd---e--- OK (72 out of 1217, remaining: 06:10)
test 0073...[HTTP, receive cookies when using custom Host:, domain using only two dots]
-pd--oe--- OK (73 out of 1217, remaining: 06:06)
test 0074...[HTTP, urlglob {}-retrieval and -o #[num] usage]
-p---oe--- OK (74 out of 1217, remaining: 06:02)
test 0075...[HTTP, urlglob retrieval with bad range]
s-----e--- OK (75 out of 1217, remaining: 05:58)
test 0076...[HTTP, -O with no file name part in the URL]
------e--- OK (76 out of 1217, remaining: 05:53)
test 0077...[HTTP with -z "older date"]
-pd---e--- OK (77 out of 1217, remaining: 05:49)
test 0078...[HTTP with -z "newer date"]
-pd---e--- OK (78 out of 1217, remaining: 05:44)
test 0086...[HTTP, urlglob []-retrieval and -o #[num] usage]
-p---oe--- OK (86 out of 1217, remaining: 05:13)
test 0087...[urlglob with out of range -o #[num] usage]
-----oe--- OK (87 out of 1217, remaining: 05:09)
test 0088...[HTTP PUT with Digest authorization]
-pd---e--- OK (88 out of 1217, remaining: 05:20)
test 0089...[HTTP with NTLM and follow-location]
-pd---e--- OK (89 out of 1217, remaining: 05:18)
test 0090...[HTTP with NTLM via --anyauth, and then follow-location with NTLM again]
-pd---e--- OK (90 out of 1217, remaining: 05:17)
test 0091...[HTTP with NTLM/Negotiate/Basic, anyauth and user with domain, with size 0]
-pd---e--- OK (91 out of 1217, remaining: 05:15)
test 0092...[HTTP resume transfer with the whole file already downloaded]
-pd---e--- OK (92 out of 1217, remaining: 05:12)
test 0096 SKIPPED: curl lacks TrackMemory support
test 0097...[HTTP POST with custom content-type]
-pd---e--- OK (97 out of 1217, remaining: 04:55)
test 0098...[HTTP PUT from stdin with set size, disabling chunked transfer-encoding]
-pd---e--- OK (98 out of 1217, remaining: 05:03)
test 0099...[HTTP GET with large-file resume point and failed resume]
-pd---e--- OK (99 out of 1217, remaining: 05:01)
test 0100...[FTP dir list PASV]
-pd---e--- OK (100 out of 1217, remaining: 05:22)
test 0101...[FTP dir list, PORT with specified IP]
-pd---e--- OK (101 out of 1217, remaining: 05:19)
test 0102...[FTP RETR PASV]
-pd---e--- OK (102 out of 1217, remaining: 05:17)
test 0103...[FTP RETR PORT with CWD]
-pd---e--- OK (103 out of 1217, remaining: 05:15)
test 0104...[FTP --head to get file size only]
-p----e--- OK (104 out of 1217, remaining: 05:12)
test 0105...[FTP user+password in URL and ASCII transfer]
-pd---e--- OK (105 out of 1217, remaining: 05:10)
test 0106...[FTP GET with type=A style ASCII URL using %20 codes]
-pd---e--- OK (106 out of 1217, remaining: 05:08)
test 0107...[FTP PASV upload file]
-p-u--e--- OK (107 out of 1217, remaining: 05:06)
test 0108...[FTP PORT upload with CWD]
-p-u--e--- OK (108 out of 1217, remaining: 05:03)
test 0109...[FTP PASV upload append]
-p-u--e--- OK (109 out of 1217, remaining: 05:02)
test 0110...[FTP download resume with set limit]
-pd---e--- OK (110 out of 1217, remaining: 05:00)
test 0111...[FTP download resume beyond file size]
-p----e--- OK (111 out of 1217, remaining: 04:58)
test 0112...[FTP PASV upload resume]
-p-u--e--- OK (112 out of 1217, remaining: 04:56)
test 0113...[FTP download, failed login: USER not valid]
-p----e--- OK (113 out of 1217, remaining: 04:54)
test 0114...[FTP download, failed login: PASS not valid]
-p----e--- OK (114 out of 1217, remaining: 04:51)
test 0115...[FTP download, failed PASV]
-p----e--- OK (115 out of 1217, remaining: 04:49)
test 0116...[FTP download, failed PORT]
-p----e--- OK (116 out of 1217, remaining: 04:47)
test 0117...[FTP download, failed TYPE]
-p----e--- OK (117 out of 1217, remaining: 04:45)
test 0118...[FTP download, failed RETR]
-p----e--- OK (118 out of 1217, remaining: 04:42)
test 0119...[FTP download, failed RETR with PORT]
-p----e--- OK (119 out of 1217, remaining: 04:40)
test 0120...[ftp download with post-quote delete operation]
-pd---e--- OK (120 out of 1217, remaining: 04:39)
test 0121...[ftp download with post- and pre-transfer delete operations]
-pd---e--- OK (121 out of 1217, remaining: 04:38)
test 0122...[FTP download resume with whole file already downloaded]
-p----e--- OK (122 out of 1217, remaining: 04:36)
test 0123...[FTP upload resume with whole file already downloaded]
-p----e--- OK (123 out of 1217, remaining: 04:34)
test 0124...[FTP download, failed PWD]
-pd---e--- OK (124 out of 1217, remaining: 04:32)
test 0125...[FTP download, failed CWD]
-p----e--- OK (125 out of 1217, remaining: 04:30)
test 0126...[FTP download with multiple replies at once in RETR]
-pd---e--- OK (126 out of 1217, remaining: 04:29)
test 0127...[FTP --disable-epsv]
-pd---e--- OK (127 out of 1217, remaining: 04:27)
test 0128...[FTP upload with --crlf]
-p-u--e--- OK (128 out of 1217, remaining: 04:26)
test 0129...[FTP GET with type=A style ASCII URL and understated server SIZE]
-pd---e--- OK (129 out of 1217, remaining: 04:24)
test 0130...[FTP (optional .netrc; no user/pass) dir list PASV]
-pd---e--- OK (130 out of 1217, remaining: 04:23)
test 0131...[FTP (optional .netrc; user/no pass) dir list PASV]
-pd---e--- OK (131 out of 1217, remaining: 04:22)
test 0132...[FTP (optional .netrc; user/passwd supplied) dir list PASV]
-pd---e--- OK (132 out of 1217, remaining: 04:21)
test 0133...[FTP (compulsory .netrc; ignored user/passwd) dir list PASV]
-pd---e--- OK (133 out of 1217, remaining: 04:20)
test 0134...[FTP (optional .netrc; programmatic user/passwd) dir list PASV]
-pd---e--- OK (134 out of 1217, remaining: 04:19)
test 0135...[FTP retrieve a byte-range]
-pd---e--- OK (135 out of 1217, remaining: 04:17)
test 0136...[FTP with user and no password]
-pd---e--- OK (136 out of 1217, remaining: 04:16)
test 0137...[FTP download without size in RETR string]
-pd---e--- OK (137 out of 1217, remaining: 04:15)
test 0138...[FTP download without size in RETR string and no SIZE command]
-pd---e--- OK (138 out of 1217, remaining: 04:14)
test 0139...[FTP download a newer file with -z]
-pd---e--- OK (139 out of 1217, remaining: 04:12)
test 0140...[FTP download file with -z, expected to not transfer]
-p----e--- OK (140 out of 1217, remaining: 04:11)
test 0141...[FTP download info with -I]
sp----e--- OK (141 out of 1217, remaining: 04:09)
test 0142...[FTP URL with 150 dir levels]
-pd---e--- OK (142 out of 1217, remaining: 04:08)
test 0143...[FTP URL with type=a]
-pd---e--- OK (143 out of 1217, remaining: 04:07)
test 0144...[FTP NLST dir list without contents, using PORT]
-p----e--- OK (144 out of 1217, remaining: 04:05)
test 0145...[FTP NLST dir list with weird reply code, using PORT]
-p----e--- OK (145 out of 1217, remaining: 04:04)
test 0146...[persistent FTP with different paths]
-pd---e--- OK (146 out of 1217, remaining: 04:04)
test 0147...[FTP with --ftp-create-dirs (failing CWD)]
-pd---e--- OK (147 out of 1217, remaining: 04:03)
test 0148...[FTP with --ftp-create-dirs (failing MKD)]
-p----e--- OK (148 out of 1217, remaining: 04:01)
test 0149...[FTP with multiple uploads]
-p---oe--- OK (149 out of 1217, remaining: 04:01)
test 0150...[HTTP with NTLM authorization and --fail]
-pd---e--- OK (150 out of 1217, remaining: 04:00)
test 0151...[HTTP GET with an error code that might trick authentication]
-pd---e--- OK (151 out of 1217, remaining: 03:59)
test 0152...[HTTP GET with an error code that might trick authentication and --fail]
-p----e--- OK (152 out of 1217, remaining: 03:58)
test 0153...[HTTP with Digest authorization with stale=true]
sp----e--- OK (153 out of 1217, remaining: 03:57)
test 0154...[HTTP PUT with --anyauth authorization (picking Digest)]
-pd---e--- OK (154 out of 1217, remaining: 04:03)
test 0155...[HTTP PUT with --anyauth authorization (picking NTLM)]
-pd---e--- OK (155 out of 1217, remaining: 04:09)
test 0156...[HTTP PUT with --anyauth (when the server requires none)]
-pd---e--- OK (156 out of 1217, remaining: 04:15)
test 0157...[HTTP GET with --anyauth (when the server requires none)]
-pd---e--- OK (157 out of 1217, remaining: 04:14)
test 0158...[HTTP multipart formpost with only a 100 reply]
-pd---e--- OK (158 out of 1217, remaining: 04:12)
test 0159...[HTTP with NTLM authorization when talking HTTP/1.0 (known to fail)]
-pd---e--- OK (159 out of 1217, remaining: 04:11)
test 0160...[HTTP with delayed close, conn reuse, connection reset and retry]
sp----e--- OK (160 out of 1217, remaining: 04:23)
test 0161...[FTP RETR PASV]
-pd---e--- OK (161 out of 1217, remaining: 04:22)
test 0163...[HTTP multipart formpost with contents from a file]
-pd---e--- OK (163 out of 1217, remaining: 04:19)
test 0164...[HTTP range with multiple ranges]
-pd---e--- OK (164 out of 1217, remaining: 04:18)
test 0165 SKIPPED: curl lacks idn support
test 0166...[HTTP formpost a file with spaces in name]
-pd---e--- OK (166 out of 1217, remaining: 04:15)
test 0172...[HTTP with cookies file and custom added cookie]
-pd---e--- OK (172 out of 1217, remaining: 04:05)
test 0173...[HTTP RFC1867-formpost a file from stdin with "faked" filename]
-pd---e--- OK (173 out of 1217, remaining: 04:03)
test 0174...[HTTP POST --anyauth to server not requiring any auth at all]
-pd---e--- OK (174 out of 1217, remaining: 04:02)
test 0175...[HTTP POST --digest to server not requiring any auth at all]
-pd---e--- OK (175 out of 1217, remaining: 04:02)
test 0176...[HTTP POST --ntlm to server not requiring any auth at all]
-pd---e--- OK (176 out of 1217, remaining: 04:01)
test 0177...[HTTP POST --digest to server doing a 302-location response]
-pd---e--- OK (177 out of 1217, remaining: 04:00)
test 0178...[HTTP response with negative Content-Length]
-pd---e--- OK (178 out of 1217, remaining: 03:59)
test 0180...[HTTP 1.0 PUT]
-pd---e--- OK (180 out of 1217, remaining: 03:56)
test 0181...[HTTP 1.0 POST]
-pd---e--- OK (181 out of 1217, remaining: 03:55)
test 0182...[FTP download an empty file]
-pd---e--- OK (182 out of 1217, remaining: 03:54)
test 0186...[HTTP RFC1867-type formposting with types on text fields]
-pd---e--- OK (186 out of 1217, remaining: 03:49)
test 0187...[HTTP redirect with bad host name separation and slash in parameters]
-pd---e--- OK (187 out of 1217, remaining: 03:48)
test 0188...[HTTP GET with resume and redirect]
-pd---e--- OK (188 out of 1217, remaining: 03:47)
test 0189...[HTTP GET with resume and redirect (to a page that doesn't resume)]
-pd---e--- OK (189 out of 1217, remaining: 03:45)
test 0190...[FTP download with strict timeout and slow CWD]
-p----e--- OK (190 out of 1217, remaining: 04:28)
test 0191...[FTP URL with ?-letters in username and password ]
-pd---e--- OK (191 out of 1217, remaining: 04:38)
test 0192...[HTTP GET -w num_connects with one simple connect]
sp----e--- OK (192 out of 1217, remaining: 04:37)
test 0193...[HTTP GET -w num_connects with redirected fetch (2 connects)]
sp----e--- OK (193 out of 1217, remaining: 04:35)
test 0194...[HTTP resume transfer with the whole file already downloaded and --fail]
-pd---e--- OK (194 out of 1217, remaining: 04:34)
test 0195...[FTP response 530 after PASS, temporarily not allowed access]
-p----e--- OK (195 out of 1217, remaining: 04:33)
test 0196...[FTP transient error, retry request once]
-p----e--- OK (196 out of 1217, remaining: 04:37)
test 0197...[HTTP GET --retry on 503 error with output to stdout]
sp----e--- OK (197 out of 1217, remaining: 04:41)
test 0198...[HTTP GET --retry on 503 error with output to file]
-pd---e--- OK (198 out of 1217, remaining: 04:45)
test 0199...[HTTP with -d, -G and {}]
-pd---e--- OK (199 out of 1217, remaining: 04:43)
test 0200...[basic file:// file]
--d---e--- OK (200 out of 1217, remaining: 04:42)
test 0201...[missing file:// file]
------e--- OK (201 out of 1217, remaining: 04:40)
test 0202...[two file:// URLs to stdout]
s-----e--- OK (202 out of 1217, remaining: 04:39)
test 0203...[file:/path URL with a single slash]
--d---e--- OK (203 out of 1217, remaining: 04:37)
test 0204...["upload" with file://]
-----oe--- OK (204 out of 1217, remaining: 04:36)
test 0205...["upload" with file://]
------e--- OK (205 out of 1217, remaining: 04:35)
test 0207...[HTTP GET with chunked Transfer-Encoding closed prematurely]
-pd---e--- OK (207 out of 1217, remaining: 04:32)
test 0210...[Get two FTP files from the same remote dir: no second CWD]
-pd---e--- OK (210 out of 1217, remaining: 04:28)
test 0211...[Get two FTP files with no remote EPSV support]
-pd---e--- OK (211 out of 1217, remaining: 04:27)
test 0212...[Get two FTP files with no remote EPRT support]
-pd---e--- OK (212 out of 1217, remaining: 04:27)
test 0214...[HTTP URL with escaped { and }]
-pd---e--- OK (214 out of 1217, remaining: 04:24)
test 0215...[Get two FTP dir listings from the same remote dir: no second CWD]
-pd---e--- OK (215 out of 1217, remaining: 04:23)
test 0216...[FTP upload two files to the same dir]
-p----e--- OK (216 out of 1217, remaining: 04:23)
test 0218...[HTTP PUT from a file but enforce chunked transfer-encoding]
-pd---e--- OK (218 out of 1217, remaining: 04:25)
test 0220...[HTTP GET gzip compressed content]
-pd---e--- OK (220 out of 1217, remaining: 04:22)
test 0221...[HTTP GET gzip compressed content with broken gzip header]
-pd---e--- OK (221 out of 1217, remaining: 04:21)
test 0222...[HTTP GET deflate compressed content]
-pd---e--- OK (222 out of 1217, remaining: 04:20)
test 0223...[HTTP GET deflate compressed content with broken deflate header]
-pd---e--- OK (223 out of 1217, remaining: 04:19)
test 0224...[HTTP GET gzip compressed content with huge comment and extra field]
-pd---e--- OK (224 out of 1217, remaining: 04:18)
test 0225...[FTP %0a-code in URL's name part]
------e--- OK (225 out of 1217, remaining: 04:17)
test 0226...[FTP %0d-code in URL's CWD part]
------e--- OK (226 out of 1217, remaining: 04:15)
test 0227...[FTP with quote ops]
-pd---e--- OK (227 out of 1217, remaining: 04:14)
test 0228...[FTP RETR with ACCT]
-pd---e--- OK (228 out of 1217, remaining: 04:14)
test 0229...[FTP RETR with bad ACCT]
-p----e--- OK (229 out of 1217, remaining: 04:13)
test 0230...[HTTP GET multiply compressed content]
-pd---e--- OK (230 out of 1217, remaining: 04:11)
test 0231...[file:// with resume]
--d---e--- OK (231 out of 1217, remaining: 04:10)
test 0232...[HTTP GET deflate raw-compressed content]
-pd---e--- OK (232 out of 1217, remaining: 04:09)
test 0235...[FTP resumed upload but no file present remotely]
-p-u--e--- OK (235 out of 1217, remaining: 04:06)
test 0236...[FTP resume upload but denied access to remote file]
-p----e--- OK (236 out of 1217, remaining: 04:05)
test 0237...[FTP getting bad host in 227-response to PASV]
-p----e--- OK (237 out of 1217, remaining: 04:04)
test 0238...[FTP getting bad port in response to EPSV]
-p----e--- OK (238 out of 1217, remaining: 04:03)
test 0240...[HTTP-IPv6 GET]
-pd---e--- OK (240 out of 1217, remaining: 04:09)
test 0241...[HTTP-IPv6 GET (using ip6-localhost)]
-pd---e--- OK (241 out of 1217, remaining: 04:08)
test 0242...[HTTP-IPv6 GET with username+password in URL]
-pd---e--- OK (242 out of 1217, remaining: 04:06)
test 0244...[FTP dir listing with nocwd and URL encoded path]
-pd---e--- OK (244 out of 1217, remaining: 04:05)
test 0245...[HTTP POST --digest]
-pd---e--- OK (245 out of 1217, remaining: 04:04)
test 0246...[HTTP POST --digest with server doing a 100 before 401 response]
-pd---e--- OK (246 out of 1217, remaining: 04:03)
test 0247...[FTP upload time condition evaluates TRUE => skip upload]
-p----e--- OK (247 out of 1217, remaining: 04:02)
test 0248...[FTP upload time condition evaluates FALSE => upload anyway]
-p-u--e--- OK (248 out of 1217, remaining: 04:01)
test 0249...[HTTP 304 response with "illegal" Content-Length: header]
-pd---e--- OK (249 out of 1217, remaining: 04:00)
test 0250...[FTP dir list PASV with slow response]
-pd---e--- OK (250 out of 1217, remaining: 04:39)
test 0251...[FTP dir list, PORT with specified IP and slow response]
-pd---e--- OK (251 out of 1217, remaining: 05:19)
test 0252...[FTP IPv6 dir list PASV]
-pd---e--- OK (252 out of 1217, remaining: 05:26)
test 0253...[FTP IPv6 dir list with EPRT]
-pd---e--- OK (253 out of 1217, remaining: 05:25)
test 0254...[FTP IPv6 dir list PASV and --disable-epsv]
-pd---e--- OK (254 out of 1217, remaining: 05:23)
test 0255...[FTP IPv6 dir list with EPRT and --disable-eprt]
-pd---e--- OK (255 out of 1217, remaining: 05:22)
test 0260...[HTTP GET URL without slash but with questionmark]
-pd---e--- OK (260 out of 1217, remaining: 05:15)
test 0261...[FTP RETR with 226 response code to TYPE]
-pd---e--- OK (261 out of 1217, remaining: 05:14)
test 0262...[HTTP GET with binary zeroes in header]
-pd---e--- OK (262 out of 1217, remaining: 05:13)
test 0266...[HTTP GET with chunked Transfer-Encoding and chunked trailer]
-pd--oe--- OK (266 out of 1217, remaining: 05:07)
test 0267...[HTTP POST with NTLM authorization and added custom headers]
-pd---e--- OK (267 out of 1217, remaining: 05:06)
test 0268...[HTTP POST a non-existing file]
-pd---e--- OK (268 out of 1217, remaining: 05:04)
test 0269...[HTTP --ignore-content-length]
-pd---e--- OK (269 out of 1217, remaining: 05:03)
test 0270...[FTP RETR PASV --ftp-skip-pasv-ip]
-pd---e--- OK (270 out of 1217, remaining: 05:02)
test 0271...[TFTP retrieve]
-pd---e--- OK (271 out of 1217, remaining: 05:08)
test 0272...[FTP timed conditioned get file with identical time stamp ]
-p----e--- OK (272 out of 1217, remaining: 05:07)
test 0273...[HTTP with two Digest authorization headers]
-pd---e--- OK (273 out of 1217, remaining: 05:06)
test 0274...[HTTP Location: following with --max-redirs 0]
-pd---e--- OK (274 out of 1217, remaining: 05:05)
test 0276...[HTTP Location: following with multiple question marks in URLs]
-pd---e--- OK (276 out of 1217, remaining: 05:02)
test 0277...[HTTP RFC1867-type formposting with custom Content-Type]
-pd---e--- OK (277 out of 1217, remaining: 05:01)
test 0280...[FTP --ftp-alternative-to-user on USER failure]
-pd---e--- OK (280 out of 1217, remaining: 04:57)
test 0281...[HTTP PUT from file with 100 + 401 responses and -f without auth given]
-pd---e--- OK (281 out of 1217, remaining: 05:00)
test 0282...[HTTP GET with no response body or headers]
-pd---e--- OK (282 out of 1217, remaining: 04:59)
test 0283...[TFTP retrieve on invalid file]
-p----e--- OK (283 out of 1217, remaining: 04:57)
test 0284...[TFTP retrieve of boundary case 512 byte file]
-pd---e--- OK (284 out of 1217, remaining: 04:56)
test 0285...[TFTP send]
-p-u--e--- OK (285 out of 1217, remaining: 05:12)
test 0286...[TFTP send of boundary case 512 byte file]
-p-u--e--- OK (286 out of 1217, remaining: 05:27)
test 0288...[file:// with (unsupported) proxy, authentication and range]
--d---e--- OK (288 out of 1217, remaining: 05:24)
test 0289...[FTP resume upload but denied access to local file]
------e--- OK (289 out of 1217, remaining: 05:23)
test 0290...[FTP download maximum filesize exceeded]
-p----e--- OK (290 out of 1217, remaining: 05:21)
test 0291...[FTP download maximum filesize not exceeded]
-pd---e--- OK (291 out of 1217, remaining: 05:20)
test 0292...[HTTP GET with maximum filesize not exceeded]
-pd---e--- OK (292 out of 1217, remaining: 05:19)
test 0293...[HTTP GET with maximum filesize exceeded]
-p----e--- OK (293 out of 1217, remaining: 05:18)
test 0294...[FTP --ftp-account on ACCT request]
-pd---e--- OK (294 out of 1217, remaining: 05:17)
test 0295...[FTP ACCT request without --ftp-account]
-p----e--- OK (295 out of 1217, remaining: 05:16)
test 0296...[FTP CWD with --ftp-method multicwd]
-pd---e--- OK (296 out of 1217, remaining: 05:15)
test 0297...[FTP CWD with --ftp-method singlecwd]
-pd---e--- OK (297 out of 1217, remaining: 05:14)
test 0298...[FTP CWD with --ftp-method nocwd]
-pd---e--- OK (298 out of 1217, remaining: 05:13)
test 0300...[simple HTTPS GET]
-pd---e--- OK (300 out of 1217, remaining: 05:16)
test 0301...[HTTPS GET with user and password]
-pd---e--- OK (301 out of 1217, remaining: 05:15)
test 0303...[HTTPS with 8 secs timeout]
-pd---e--- OK (303 out of 1217, remaining: 06:13)
test 0304...[HTTPS multipart formpost]
-pd---e--- OK (304 out of 1217, remaining: 06:15)
test 0305...[insecure HTTPS without permission]
------e--- OK (305 out of 1217, remaining: 06:14)
test 0306...[HTTPS GET, receive no headers only data!]
-pd---e--- OK (306 out of 1217, remaining: 06:13)
test 0307 SKIPPED: openssl engine not supported
test 0308...[simple HTTPS GET with invalid crypto engine]
------e--- OK (308 out of 1217, remaining: 06:10)
test 0309...[HTTP Location: redirect to HTTPS URL]
-pd---e--- OK (309 out of 1217, remaining: 06:09)
test 0310...[simple HTTPS GET]
-pd---e--- OK (310 out of 1217, remaining: 06:35)
test 0311...[HTTPS wrong subjectAltName but right CN]
------e--- OK (311 out of 1217, remaining: 07:00)
test 0312...[HTTPS GET to localhost and null-prefixed CN cert]
------e--- OK (312 out of 1217, remaining: 07:25)
test 0313...[CRL test]
------e--- OK (313 out of 1217, remaining: 07:49)
test 0314 SKIPPED: curl lacks brotli support
test 0315 SKIPPED: curl lacks brotli support
test 0316 SKIPPED: curl lacks brotli support
test 0319...[HTTP GET gzip transfer-encoded data in raw mode]
-pd---e--- OK (319 out of 1217, remaining: 07:38)
test 0320...[simple TLS-SRP HTTPS GET, check user in response]
-----oe--- OK (320 out of 1217, remaining: 08:08)
test 0321...[TLS-SRP with bad username and password]
------e--- OK (321 out of 1217, remaining: 08:06)
test 0322...[TLS-SRP with bad password]
------e--- OK (322 out of 1217, remaining: 08:04)
test 0323...[TLS-SRP to non-TLS-SRP server]
------e--- OK (323 out of 1217, remaining: 08:28)
test 0324...[TLS-SRP with server cert checking]
------e--- OK (324 out of 1217, remaining: 08:26)
test 0325...[HTTPS with attempted redirect to denied HTTP]
-pd---e--- OK (325 out of 1217, remaining: 08:24)
test 0326...[HTTP GET chunked data in raw mode]
-pd---e--- OK (326 out of 1217, remaining: 08:22)
test 0327...[HTTP with cookiejar without cookies left]
-pd--oe--- OK (327 out of 1217, remaining: 08:20)
test 0328...[HTTP with "Content-Encoding: none]
-pd---e--- OK (328 out of 1217, remaining: 08:18)
test 0329...[HTTP cookie with Max-Age=0]
-pd---e--- OK (329 out of 1217, remaining: 08:17)
test 0330...[HTTP with custom Cookie: and redirect to new host]

goto problem 2
330: protocol FAILED:
--- log/check-expected 2019-01-12 04:04:38.087402414 +0100
+++ log/check-generated 2019-01-12 04:04:38.087402414 +0100
@@ -1,11 +0,0 @@
-GET http://first.host.it.is/we/want/that/page/317 HTTP/1.1[CR][LF]
-Host: first.host.it.is[CR][LF]
-Accept: */*[CR][LF]
-Proxy-Connection: Keep-Alive[CR][LF]
-Cookie: test=yes[CR][LF]
-[CR][LF]
-GET http://goto.second.host.now/3170002 HTTP/1.1[CR][LF]
-Host: goto.second.host.now[CR][LF]
-Accept: */*[CR][LF]
-Proxy-Connection: Keep-Alive[CR][LF]
-[CR][LF]
== Contents of files in the log/ dir after test 330
=== Start of file check-expected
GET http://first.host.it.is/we/want/that/page/317 HTTP/1.1[CR][LF]
Host: first.host.it.is[CR][LF]
Accept: */*[CR][LF]
Proxy-Connection: Keep-Alive[CR][LF]
Cookie: test=yes[CR][LF]
[CR][LF]
GET http://goto.second.host.now/3170002 HTTP/1.1[CR][LF]
Host: goto.second.host.now[CR][LF]
Accept: */*[CR][LF]
Proxy-Connection: Keep-Alive[CR][LF]
[CR][LF]
=== End of file check-expected
=== Start of file stderr330
% Total % Received % Xferd Average Speed Time Time Time Current
Dload Upload Total Spent Left Speed

0 0 0 0 0 0 0 0 --:--:-- --:--:-- --:--:-- 0curl: (6) Could not resolve host: first.host.it.is
=== End of file stderr330
=== Start of file trace330
04:04:38.231322 == Info: Expire in 0 ms for 6 (transfer 0x97a949c)
04:04:38.231479 == Info: STATE: INIT => CONNECT handle 0x97a949c; line 1443 (connection #-5000)
04:04:38.231781 == Info: Added connection 0. The cache now contains 1 members
04:04:38.231954 == Info: Expire in 1 ms for 1 (transfer 0x97a949c)
04:04:38.232019 == Info: STATE: CONNECT => WAITRESOLVE handle 0x97a949c; line 1478 (connection #0)
04:04:38.232411 == Info: Expire in 0 ms for 1 (transfer 0x97a949c)
04:04:38.232491 == Info: Expire in 1 ms for 1 (transfer 0x97a949c)
04:04:38.232503 == Info: Expire in 0 ms for 1 (transfer 0x97a949c)
04:04:38.232515 == Info: Expire in 0 ms for 1 (transfer 0x97a949c)
04:04:38.232537 == Info: Expire in 2 ms for 1 (transfer 0x97a949c)
04:04:38.232547 == Info: Expire in 0 ms for 1 (transfer 0x97a949c)
04:04:38.232559 == Info: Expire in 0 ms for 1 (transfer 0x97a949c)
04:04:38.232636 == Info: Expire in 2 ms for 1 (transfer 0x97a949c)
04:04:38.232647 == Info: Expire in 0 ms for 1 (transfer 0x97a949c)
04:04:38.232660 == Info: Expire in 0 ms for 1 (transfer 0x97a949c)
04:04:38.232684 == Info: Could not resolve host: first.host.it.is
04:04:38.232737 == Info: Expire in 0 ms for 1 (transfer 0x97a949c)
04:04:38.232760 == Info: Closing connection 0
04:04:38.232776 == Info: The cache now contains 0 members
04:04:38.232907 == Info: Expire cleared (transfer 0x97a949c)
=== End of file trace330
test 0340...[FTP using %00 in path with singlecwd]
-p----e--- OK (331 out of 1217, remaining: 08:13)
test 0350...[FTP root dir list multicwd]
-pd---e--- OK (332 out of 1217, remaining: 08:11)
test 0351...[FTP root dir list nocwd]
-pd---e--- OK (333 out of 1217, remaining: 08:10)
test 0352...[FTP root dir list singlecwd]
-pd---e--- OK (334 out of 1217, remaining: 08:08)
test 0353...[FTP home dir list singlecwd]
-pd---e--- OK (335 out of 1217, remaining: 08:06)
test 0354...[FTP without password]
-pd---e--- OK (336 out of 1217, remaining: 08:04)
test 0393...[HTTP max-filesize and out-of-range Content-Length]
-p----e--- OK (337 out of 1217, remaining: 08:03)
test 0394...[HTTP with rubbish in Content-Length]
-p----e--- OK (338 out of 1217, remaining: 08:01)
test 0395...[HTTP and out-of-range Content-Length]
-p----e--- OK (339 out of 1217, remaining: 08:00)
test 0400...[FTPS dir list PASV unencrypted data]
-pd---e--- OK (340 out of 1217, remaining: 08:03)
test 0401...[FTPS PASV upload file]
-p-u--e--- OK (341 out of 1217, remaining: 08:02)
test 0402...[FTP SSL required on non-SSL server]
-p----e--- OK (342 out of 1217, remaining: 08:00)
test 0403...[FTPS with CCC not supported by server]
-pd---e--- OK (343 out of 1217, remaining: 07:58)
test 0404...[FTPS with invalid cacert]
------e--- OK (344 out of 1217, remaining: 07:57)
test 0405...[FTPS operation to FTP port]
------e--- OK (345 out of 1217, remaining: 07:55)
test 0406...[FTPS dir list, PORT with specified IP]
-pd---e--- OK (346 out of 1217, remaining: 07:53)
test 0407...[Get two FTPS files from the same remote dir: no second CWD]
-pd---e--- OK (347 out of 1217, remaining: 07:52)
test 0408...[FTPS PORT upload with CWD]
-p-u--e--- OK (348 out of 1217, remaining: 07:51)
test 0409...[FTPS PASV upload file]
-p-u--e--- OK (349 out of 1217, remaining: 07:49)
test 0500...[simple libcurl HTTP GET tool]
-pd--oe--- OK (350 out of 1217, remaining: 07:49)
test 0501...[simple libcurl attempt operation without URL set]
------e--- OK (351 out of 1217, remaining: 07:47)
test 0502...[simple multi file:// get]
--d---e--- OK (352 out of 1217, remaining: 07:46)
test 0505...[FTP upload with rename after transfer]
-p-u--e--- OK (355 out of 1217, remaining: 07:41)
test 0506 SKIPPED: curl has threaded-resolver support
test 0507...[multi interface get with non-existing host name]
------e--- OK (357 out of 1217, remaining: 07:40)
test 0508...[send HTTP POST using read callback]
-pd---e--- OK (358 out of 1217, remaining: 07:39)
test 0509...[initialization with memory callbacks and actual usage]
s-----e--- OK (359 out of 1217, remaining: 07:37)
test 0510...[send HTTP POST using read callback, using chunked transfer-encoding]
-pd---e--- OK (360 out of 1217, remaining: 07:38)
test 0511...[FTP with FILETIME and NOBODY but missing file]
-p----e--- OK (361 out of 1217, remaining: 07:37)
test 0512...[simple curl_easy_duplicate() test]
-pd---e--- OK (362 out of 1217, remaining: 07:35)
test 0513...[send HTTP POST using read callback that returns CURL_READFUNC_ABORT]
-p----e--- OK (363 out of 1217, remaining: 07:36)
test 0514...[First set options to POST and then to make HEAD]
-pd---e--- OK (364 out of 1217, remaining: 07:37)
test 0515...[make a POSTFIELDS set to NULL with POSTFIELDSIZE set to zero]
-pd---e--- OK (365 out of 1217, remaining: 07:36)
test 0516...[make a HTTPPOST set to NULL]
-pd---e--- OK (366 out of 1217, remaining: 07:34)
test 0517...[curl_getdate() testing]
------e--- OK (367 out of 1217, remaining: 07:33)
test 0518 SKIPPED: rlimit problem: fds needed 1050 > system limit 1040
test 0519...[GET same URL twice with different users]
-pd---e--- OK (369 out of 1217, remaining: 07:30)
test 0520...[FTP RETR with FILETIME]
-pd---e--- OK (370 out of 1217, remaining: 07:29)
test 0521...[FTP dir list PASV with CURLOPT_PORT]
-pd---e--- OK (371 out of 1217, remaining: 07:27)
test 0522...[HTTP GET with CURLOPT_PORT]
sp----e--- OK (372 out of 1217, remaining: 07:26)
test 0524...[FTP upload with target URL ending with slash]
-p----e--- OK (374 out of 1217, remaining: 07:23)
test 0525...[FTP PORT upload using multi interface]
-p-u--e--- OK (375 out of 1217, remaining: 07:21)
test 0526...[FTP RETR same file using different handles but same connection]
-pd---e--- OK (376 out of 1217, remaining: 07:27)
test 0527...[FTP RETR same file using different handles but same connection]
-pd---e--- OK (377 out of 1217, remaining: 07:33)
test 0528...[HTTP GET same file using different handles but same connection]
-pd---e--- OK (378 out of 1217, remaining: 07:38)
test 0529...[FTP PORT upload using multi interface (weird cleanup function sequence)]
-p-u--e--- OK (379 out of 1217, remaining: 07:37)
test 0531...[FTP PORT upload using multi interface and get 425 response]
-p----e--- OK (380 out of 1217, remaining: 07:35)
test 0532...[FTP RETR same file using reset handles between each transfer]
-pd---e--- OK (381 out of 1217, remaining: 07:41)
test 0533...[FTP RETR a non-existing file twice using the multi interface]
-p----e--- OK (382 out of 1217, remaining: 07:42)
test 0534...[FTP RETR twice using multi: non-existing host and non-existing file]
-p----e--- OK (383 out of 1217, remaining: 07:44)
test 0535...[HTTP GET multi two files with FAILONERROR]
-pd---e--- OK (384 out of 1217, remaining: 07:45)
test 0537...[HTTP GET with a HUGE number of file descriptors open]
-pd---e--- OK (385 out of 1217, remaining: 07:44)
test 0538...[FTP multi-interface download, failed login: PASS not valid]
-p----e--- OK (386 out of 1217, remaining: 07:42)
test 0539...[Two FTP fetches using different CURLOPT_FTP_FILEMETHOD]
-pd---e--- OK (387 out of 1217, remaining: 07:41)
test 0541...[FTP upload and upload same file again without rewind]
-p----e--- OK (389 out of 1217, remaining: 07:38)
test 0542...[FTP a file with NOBODY yes and HEADER no]
-pd---e--- OK (390 out of 1217, remaining: 07:37)
test 0543...[curl_easy_escape]
s-----e--- OK (391 out of 1217, remaining: 07:35)
test 0544...[HTTP POST text data using CURLOPT_COPYPOSTFIELDS]
-pd---e--- OK (392 out of 1217, remaining: 07:34)
test 0545...[HTTP POST binary with embedded zero and no trailing zero]
-pd---e--- OK (393 out of 1217, remaining: 07:33)
test 0546...[FTP RETR a non-existing file then a found one using the multi interface]
sp----e--- OK (394 out of 1217, remaining: 07:33)
test 0553...[HTTP post with huge request headers and post data from callback]
-pd---e--- OK (401 out of 1217, remaining: 07:22)
test 0554...[HTTP multi-part formpost using read callback for the file part]
-pd---e--- OK (402 out of 1217, remaining: 07:21)
test 0556...[send and recv HTTP]
-pd---e--- OK (404 out of 1217, remaining: 07:18)
test 0557...[curl_mprintf() testing]
s-----e--- OK (405 out of 1217, remaining: 07:17)
test 0558 SKIPPED: curl lacks TrackMemory support
test 0559...[use tiny CURLOPT_BUFFERSIZE]
--d---e--- OK (407 out of 1217, remaining: 07:14)
test 0560...[simple HTTPS GET with multi interface]
-pd---e--- OK (408 out of 1217, remaining: 07:13)
test 0562...[FTP a type=A URL and CURLOPT_PORT set]
-pd---e--- OK (410 out of 1217, remaining: 07:10)
test 0565...[send HTTP POST using read callback, chunked transfer-encoding and Digest]
-pd---e--- OK (413 out of 1217, remaining: 07:08)
test 0566...[HTTP GET with CURLINFO_CONTENT_LENGTH_DOWNLOAD and 0 bytes transfer]
-pd--oe--- OK (414 out of 1217, remaining: 07:06)
test 0567...[simple RTSP OPTIONS command]
-pd---e--- OK (415 out of 1217, remaining: 07:09)
test 0568...[RTSP Announce (PUT and POST style) test]
-p----e--- OK (416 out of 1217, remaining: 07:08)
test 0569...[RTSP Session ID parsing]
-p---oe--- OK (417 out of 1217, remaining: 07:06)
test 0570...[RTSP CSeq and Session Mismatch checks]
-p----e--- OK (418 out of 1217, remaining: 07:05)
test 0571...[RTSP RTP Interleaving Test]
s----oe--- OK (419 out of 1217, remaining: 07:04)
test 0572...[RTSP GET_PARAMETER (Put/Heartbeat/Post)]
-p----e--- OK (420 out of 1217, remaining: 07:02)
test 0573...[verify connect time with multi interface]
-pd---e--- OK (421 out of 1217, remaining: 07:01)
test 0574...[FTP wildcard download - changed fnmatch, 2x perform (Unix LIST response)]
sp----e--- OK (422 out of 1217, remaining: 07:01)
test 0575...[FTP wildcard download - dup_handle and multi interface]
sp----e--- OK (423 out of 1217, remaining: 07:02)
test 0576...[FTP wildcard download - skip/parser_correctness/CURLOPT_FNMATCH_FUNCTION (Unix)]
s-----e--- OK (424 out of 1217, remaining: 07:02)
test 0577...[Funny RTSP version in response]
-p----e--- OK (425 out of 1217, remaining: 07:00)
test 0578...[HTTP POST lower than MAX_INITIAL_POST_SIZE with progress callback]
--d--oe--- OK (426 out of 1217, remaining: 06:59)
test 0579...[small chunked HTTP POSTs with digest auth. and progress callback]
--d--oe--- OK (427 out of 1217, remaining: 07:00)
test 0580...[multi interface, multiple Location: headers]
-pd---e--- OK (428 out of 1217, remaining: 06:58)
test 0581...[multi interface, multiple Content-Type: headers]
-pd---e--- OK (429 out of 1217, remaining: 06:57)
sshd configuration file curl_sshd_config failed verification
=== Start of file /build-2737/tests/log/ssh_server.log
curl_sshd_config line 10: Deprecated option AuthorizedKeysFile2
curl_sshd_config line 29: Deprecated option KeyRegenerationInterval
curl_sshd_config line 39: Deprecated option RhostsRSAAuthentication
curl_sshd_config line 40: Deprecated option RSAAuthentication
curl_sshd_config line 41: Deprecated option ServerKeyBits
curl_sshd_config line 45: Deprecated option UseLogin
Privilege separation user sshd does not exist
=== End of file /build-2737/tests/log/ssh_server.log
=== Start of file curl_sshd_config
# This is a generated file. Do not edit.
# OpenSSH 7.5.0 sshd configuration file for curl testing
#
DenyUsers !autobuild
AllowUsers autobuild
DenyGroups
AllowGroups
#
AuthorizedKeysFile /build-2737/tests/curl_client_key.pub
AuthorizedKeysFile2 /build-2737/tests/curl_client_key.pub
HostKey /build-2737/tests/curl_host_rsa_key
PidFile /build-2737/tests/.ssh_server.pid
#
Port 8999
AddressFamily any
ListenAddress 127.0.0.1
Protocol 2
#
AllowTcpForwarding yes
Banner none
ChallengeResponseAuthentication no
ClientAliveCountMax 3
ClientAliveInterval 0
GatewayPorts no
HostbasedAuthentication no
HostbasedUsesNameFromPacketOnly no
IgnoreRhosts yes
IgnoreUserKnownHosts yes
KeyRegenerationInterval 0
LoginGraceTime 30
LogLevel DEBUG2
MaxStartups 5
PasswordAuthentication no
PermitEmptyPasswords no
PermitRootLogin no
PrintLastLog no
PrintMotd no
PubkeyAuthentication yes
RhostsRSAAuthentication no
RSAAuthentication no
ServerKeyBits 768
StrictModes no
Subsystem sftp "/usr/libexec/openssh/sftp-server"
SyslogFacility AUTH
UseLogin no
X11Forwarding no
#
KerberosAuthentication no
KerberosOrLocalPasswd no
KerberosTicketCleanup yes
SkeyAuthentication no
GSSAPIAuthentication no
GSSAPICleanupCredentials yes
GSSAPIKeyExchange no
#
AcceptEnv
Compression no
KbdInteractiveAuthentication no
KeepAlive no
MaxAuthTries 10
PermitTunnel no
PermitUserEnvironment no
TCPKeepAlive no
UseDNS no
UsePAM no
X11UseLocalhost yes
#
=== End of file curl_sshd_config
RUN: failed to start the SSH server
test 0582 SKIPPED: failed starting SSH server
test 0583 SKIPPED: failed starting SSH server
test 0585...[socket open/close callbacks]
-pd---e--- OK (432 out of 1217, remaining: 07:23)
test 0586...[FTP and open/close socket callbacks]
-pd---e--- OK (433 out of 1217, remaining: 07:22)
test 0587...[HTTP multi-part formpost with aborted read callback]
-p----e--- OK (434 out of 1217, remaining: 07:21)
test 0588...[FTP PORT upload using multi interface, EPRT doesn't work]
-p-u--e--- OK (435 out of 1217, remaining: 07:19)
test 0589...[make a HTTP MIME POST set to NULL]
-pd---e--- OK (436 out of 1217, remaining: 07:18)
test 0591...[FTP multi PORT and 425 on upload]
-p----e--- OK (438 out of 1217, remaining: 07:15)
test 0592...[FTP multi PORT and 421 on upload]
-p----e--- OK (439 out of 1217, remaining: 07:14)
test 0593...[FTP multi PORT upload, no data conn and no transient neg. reply]
-p----e--- OK (440 out of 1217, remaining: 07:16)
test 0595...[verify close callbacks with passive FTP]
-pd---e--- OK (441 out of 1217, remaining: 07:15)
test 0596...[verify close callbacks with active FTP]
-pd---e--- OK (442 out of 1217, remaining: 07:13)
test 0597...[FTP connect only option]
-p----e--- OK (443 out of 1217, remaining: 07:12)
test 0598...[curl_easy_reset with referer and other strings set]
-pd---e--- OK (444 out of 1217, remaining: 07:11)
test 0599...[HTTP GET with progress callback and redirects changing content sizes]
--d--oe--- OK (445 out of 1217, remaining: 07:10)
test 0600 SKIPPED: failed starting SSH server
test 0632...[SFTP syntactically invalid host key]
------e--- OK (478 out of 1217, remaining: 06:23)
test 0643...[HTTP multi-part mimepost using read callback for the file part]
-pd---e--- OK (489 out of 1217, remaining: 06:09)
test 0644...[HTTP multi-part formpost with aborted read callback]
-p----e--- OK (490 out of 1217, remaining: 06:08)
test 0645...[HTTP multi-part chunked mimepost using read callback for the file part]
-pd---e--- OK (491 out of 1217, remaining: 06:10)
test 0646...[SMTP multipart using mime API]
-p-u--e--- OK (492 out of 1217, remaining: 06:12)
test 0647...[IMAP APPEND multipart using mime API]
-p-u--e--- OK (493 out of 1217, remaining: 06:14)
test 0648...[SMTP multipart with transfer content encoders]
-p-u--e--- OK (494 out of 1217, remaining: 06:13)
test 0649...[SMTP multipart with 7bit encoder error]
-p-u--e--- OK (495 out of 1217, remaining: 06:12)
test 0650...[HTTP formpost using form API]
-pd---e--- OK (496 out of 1217, remaining: 06:12)
test 0651...[curl_formadd with huge COPYCONTENTS]
-pd---e--- OK (497 out of 1217, remaining: 06:13)
test 0652...[SMTP with encoded huge mime data contents]
-p-u--e--- OK (498 out of 1217, remaining: 06:12)
test 0653...[Reuse of handle after altering mime data]
-pd---e--- OK (499 out of 1217, remaining: 06:11)
test 0654...[HTTP duplicate easy handle with mime data]
-pd---e--- OK (500 out of 1217, remaining: 06:11)
test 0655...[resolver start callback]
--d---e--- OK (501 out of 1217, remaining: 06:11)
test 0658...[HTTP GET]
-p----e--- OK (503 out of 1217, remaining: 06:08)
test 0800...[IMAP FETCH message]
-pd---e--- OK (520 out of 1217, remaining: 05:48)
test 0801...[IMAP FETCH message by MAILINDEX and SECTION]
-pd---e--- OK (521 out of 1217, remaining: 05:47)
test 0802...[IMAP SELECT UIDVALIDITY Success]
-pd---e--- OK (522 out of 1217, remaining: 05:46)
test 0803...[IMAP SELECT UIDVALIDITY Failure]
-p----e--- OK (523 out of 1217, remaining: 05:45)
test 0804...[IMAP doesn't perform SELECT if re-using the same mailbox]
-pd---e--- OK (524 out of 1217, remaining: 05:45)
test 0805...[IMAP APPEND message]
-p-u--e--- OK (525 out of 1217, remaining: 05:44)
test 0806...[IMAP LIST mailbox]
-pd---e--- OK (526 out of 1217, remaining: 05:43)
test 0807...[IMAP LSUB mailbox]
-pd---e--- OK (527 out of 1217, remaining: 05:42)
test 0808...[IMAP EXAMINE mailbox (CUSTOMREQUEST)]
-pd---e--- OK (528 out of 1217, remaining: 05:41)
test 0809...[IMAP mailbox STATUS (CUSTOMREQUEST)]
-pd---e--- OK (529 out of 1217, remaining: 05:40)
test 0810...[IMAP SEARCH for NEW messages]
-pd---e--- OK (530 out of 1217, remaining: 05:39)
test 0811...[IMAP CREATE mailbox (CUSTOMREQUEST)]
-p----e--- OK (531 out of 1217, remaining: 05:38)
test 0812...[IMAP DELETE mailbox (CUSTOMREQUEST)]
-p----e--- OK (532 out of 1217, remaining: 05:37)
test 0813...[IMAP RENAME mailbox (CUSTOMREQUEST)]
-p----e--- OK (533 out of 1217, remaining: 05:36)
test 0814...[IMAP CHECK mailbox (CUSTOMREQUEST)]
-p----e--- OK (534 out of 1217, remaining: 05:35)
test 0815...[IMAP STORE - delete message (CUSTOMREQUEST)]
-p----e--- OK (535 out of 1217, remaining: 05:34)
test 0816...[IMAP STORE - delete message with confirmation (CUSTOMREQUEST)]
-p----e--- OK (536 out of 1217, remaining: 05:33)
test 0817...[IMAP COPY message to mailbox (CUSTOMREQUEST)]
-p----e--- OK (537 out of 1217, remaining: 05:32)
test 0818...[IMAP NOOP (CUSTOMREQUEST)]
-pd---e--- OK (538 out of 1217, remaining: 05:31)
test 0819...[IMAP plain authentication]
-pd---e--- OK (539 out of 1217, remaining: 05:31)
test 0820...[IMAP login authentication]
-pd---e--- OK (540 out of 1217, remaining: 05:30)
test 0821...[IMAP CRAM-MD5 authentication]
-pd---e--- OK (541 out of 1217, remaining: 05:29)
test 0822...[IMAP NTLM authentication]
-pd---e--- OK (542 out of 1217, remaining: 05:28)
test 0823...[IMAP DIGEST-MD5 authentication]
-pd---e--- OK (543 out of 1217, remaining: 05:28)
test 0824...[IMAP OAuth 2.0 (XOAUTH2) authentication]
-pd---e--- OK (544 out of 1217, remaining: 05:27)
test 0825...[IMAP plain authentication with initial response]
-pd---e--- OK (545 out of 1217, remaining: 05:26)
test 0826...[IMAP login authentication with initial response]
-pd---e--- OK (546 out of 1217, remaining: 05:25)
test 0827...[IMAP NTLM authentication with initial response]
-pd---e--- OK (547 out of 1217, remaining: 05:25)
test 0828...[IMAP OAuth 2.0 (XOAUTH2) authentication with initial response]
-pd---e--- OK (548 out of 1217, remaining: 05:24)
test 0829...[IMAP with URL-encoded CR LF in the URL]
------e--- OK (549 out of 1217, remaining: 05:23)
test 0830...[IMAP CRAM-MD5 graceful cancellation]
-p----e--- OK (550 out of 1217, remaining: 05:22)
test 0831...[IMAP NTLM graceful cancellation]
-p----e--- OK (551 out of 1217, remaining: 05:21)
test 0832...[IMAP DIGEST-MD5 graceful cancellation]
-p----e--- OK (552 out of 1217, remaining: 05:20)
test 0833...[IMAP CRAM-MD5 authentication with SASL downgrade]
-pd---e--- OK (553 out of 1217, remaining: 05:19)
test 0834...[IMAP NTLM authentication with SASL downgrade]
-pd---e--- OK (554 out of 1217, remaining: 05:18)
test 0835...[IMAP DIGEST-MD5 authentication with SASL downgrade]
-pd---e--- OK (555 out of 1217, remaining: 05:18)
test 0837...[IMAP external authentication]
-pd---e--- OK (556 out of 1217, remaining: 05:17)
test 0838...[IMAP external authentication without credentials]
-pd---e--- OK (557 out of 1217, remaining: 05:16)
test 0839...[IMAP external authentication with initial response]
-pd---e--- OK (558 out of 1217, remaining: 05:15)
test 0840...[IMAP external authentication with initial response without credentials]
-pd---e--- OK (559 out of 1217, remaining: 05:15)
test 0841...[IMAP custom request doesn't check continuation data]
-pd---e--- OK (560 out of 1217, remaining: 05:14)
test 0842...[IMAP OAuth 2.0 (OAUTHBEARER) authentication]
-pd---e--- OK (561 out of 1217, remaining: 05:13)
test 0843...[IMAP OAuth 2.0 (OAUTHBEARER) authentication with initial response]
-pd---e--- OK (562 out of 1217, remaining: 05:12)
test 0844...[IMAP OAuth 2.0 (OAUTHBEARER) failure as continuation]
-p----e--- OK (563 out of 1217, remaining: 05:12)
test 0845...[IMAP OAuth 2.0 (OAUTHBEARER) failure as continuation with initial response]
-p----e--- OK (564 out of 1217, remaining: 05:11)
test 0846...[IMAP PREAUTH response]
-pd---e--- OK (565 out of 1217, remaining: 05:10)
test 0847...[IMAP FETCH message]
-pd---e--- OK (566 out of 1217, remaining: 05:09)
test 0850...[POP3 RETR message]
-pd---e--- OK (567 out of 1217, remaining: 05:11)
test 0851...[POP3 LIST one message]
-p----e--- OK (568 out of 1217, remaining: 05:10)
test 0852...[POP3 LIST invalid message]
-p----e--- OK (569 out of 1217, remaining: 05:09)
test 0853...[POP3 LIST messages from *SLOW* server]
-pd---e--- OK (570 out of 1217, remaining: 05:11)
test 0854...[POP3 LIST no messages available]
-p----e--- OK (571 out of 1217, remaining: 05:10)
test 0855...[POP3 RETR invalid message]
-p----e--- OK (572 out of 1217, remaining: 05:09)
test 0856...[POP3 invalid login]
-p----e--- OK (573 out of 1217, remaining: 05:08)
test 0857...[POP3 RETR message with dot-prefixed line]
-pd---e--- OK (574 out of 1217, remaining: 05:08)
test 0858...[POP3 DELE message (CUSTOMREQUEST)]
-p----e--- OK (575 out of 1217, remaining: 05:07)
test 0859...[POP3 STAT (CUSTOMREQUEST)]
-p----e--- OK (576 out of 1217, remaining: 05:06)
test 0860...[POP3 NOOP (CUSTOMREQUEST)]
-p----e--- OK (577 out of 1217, remaining: 05:05)
test 0861...[POP3 UIDL (CUSTOMREQUEST)]
-pd---e--- OK (578 out of 1217, remaining: 05:04)
test 0862...[POP3 retrieve message header (CUSTOMREQUEST)]
-pd---e--- OK (579 out of 1217, remaining: 05:03)
test 0863...[POP3 RSET (CUSTOMREQUEST)]
-p----e--- OK (580 out of 1217, remaining: 05:02)
test 0864...[POP3 APOP authentication]
-pd---e--- OK (581 out of 1217, remaining: 05:01)
test 0865...[POP3 plain authentication]
-pd---e--- OK (582 out of 1217, remaining: 05:00)
test 0866...[POP3 login authentication]
-pd---e--- OK (583 out of 1217, remaining: 05:00)
test 0867...[POP3 CRAM-MD5 authentication]
-pd---e--- OK (584 out of 1217, remaining: 04:59)
test 0868...[POP3 NTLM authentication]
-pd---e--- OK (585 out of 1217, remaining: 04:58)
test 0869...[POP3 DIGEST-MD5 authentication]
-pd---e--- OK (586 out of 1217, remaining: 04:57)
test 0870...[POP3 OAuth 2.0 (XOAUTH2) authentication]
-pd---e--- OK (587 out of 1217, remaining: 04:56)
test 0871...[POP3 plain authentication with initial response]
-pd---e--- OK (588 out of 1217, remaining: 04:56)
test 0872...[POP3 login authentication with initial response]
-pd---e--- OK (589 out of 1217, remaining: 04:55)
test 0873...[POP3 NTLM authentication with initial response]
-pd---e--- OK (590 out of 1217, remaining: 04:54)
test 0874...[POP3 OAuth 2.0 (XOAUTH2) authentication with initial response]
-pd---e--- OK (591 out of 1217, remaining: 04:53)
test 0875...[POP3 with URL-encoded CR LF in the URL]
------e--- OK (592 out of 1217, remaining: 04:52)
test 0876...[POP3 CRAM-MD5 graceful cancellation]
-p----e--- OK (593 out of 1217, remaining: 04:51)
test 0877...[POP3 NTLM graceful cancellation]
-p----e--- OK (594 out of 1217, remaining: 04:51)
test 0878...[POP3 DIGEST-MD5 graceful cancellation]
-p----e--- OK (595 out of 1217, remaining: 04:50)
test 0879...[POP3 CRAM-MD5 authentication with SASL downgrade]
-pd---e--- OK (596 out of 1217, remaining: 04:49)
test 0880...[POP3 NTLM authentication with SASL downgrade]
-pd---e--- OK (597 out of 1217, remaining: 04:48)
test 0881...[POP3 DIGEST-MD5 authentication with SASL downgrade]
-pd---e--- OK (598 out of 1217, remaining: 04:47)
test 0883...[POP3 external authentication]
-pd---e--- OK (599 out of 1217, remaining: 04:47)
test 0884...[POP3 external authentication without credentials]
-pd---e--- OK (600 out of 1217, remaining: 04:46)
test 0885...[POP3 external authentication with initial response]
-pd---e--- OK (601 out of 1217, remaining: 04:45)
test 0886...[POP3 external authentication with initial response without credentials]
-pd---e--- OK (602 out of 1217, remaining: 04:44)
test 0887...[POP3 OAuth 2.0 (OAUTHBEARER) authentication]
-pd---e--- OK (603 out of 1217, remaining: 04:43)
test 0888...[POP3 OAuth 2.0 (OAUTHBEARER) authentication with initial response]
-pd---e--- OK (604 out of 1217, remaining: 04:43)
test 0889...[POP3 OAuth 2.0 (OAUTHBEARER) failure as continuation]
-p----e--- OK (605 out of 1217, remaining: 04:42)
test 0890...[POP3 OAuth 2.0 (OAUTHBEARER) failure as continuation with initial response]
-p----e--- OK (606 out of 1217, remaining: 04:41)
test 0891...[POP3 with short authentication response]
-p----e--- OK (607 out of 1217, remaining: 04:40)
test 0900...[SMTP]
-p-u--e--- OK (608 out of 1217, remaining: 04:39)
test 0901...[SMTP with CRLF-dot-CRLF in data]
-p-u--e--- OK (609 out of 1217, remaining: 04:39)
test 0902...[RFC821-only SMTP server (EHLO not supported)]
-p-u--e--- OK (610 out of 1217, remaining: 04:38)
test 0903...[SMTP plain authentication]
-p-u--e--- OK (611 out of 1217, remaining: 04:37)
test 0904...[SMTP login authentication]
-p-u--e--- OK (612 out of 1217, remaining: 04:36)
test 0905...[SMTP CRAM-MD5 authentication]
-p-u--e--- OK (613 out of 1217, remaining: 04:35)
test 0906...[SMTP NTLM authentication]
-p-u--e--- OK (614 out of 1217, remaining: 04:35)
test 0907...[SMTP DIGEST-MD5 authentication]
-p-u--e--- OK (615 out of 1217, remaining: 04:34)
test 0908...[SMTP OAuth 2.0 (XOAUTH2) authentication]
-p-u--e--- OK (616 out of 1217, remaining: 04:33)
test 0909...[SMTP without SIZE support]
-p-u--e--- OK (617 out of 1217, remaining: 04:32)
test 0910...[SMTP without terminating CRLF]
-p-u--e--- OK (618 out of 1217, remaining: 04:31)
test 0911...[SMTP with no mail data]
-p-u--e--- OK (619 out of 1217, remaining: 04:30)
test 0912...[SMTP with SIZE support]
-p-u--e--- OK (620 out of 1217, remaining: 04:30)
test 0913...[SMTP with large message SIZE]
-p----e--- OK (621 out of 1217, remaining: 04:29)
test 0914...[SMTP invalid --mail-from]
-p----e--- OK (622 out of 1217, remaining: 04:28)
test 0915...[SMTP without --mail-from]
-p-u--e--- OK (623 out of 1217, remaining: 04:27)
test 0916...[SMTP with invalid --mail-rcpt]
-p----e--- OK (624 out of 1217, remaining: 04:27)
test 0917...[SMTP with multiple --mail-rcpt]
-p-u--e--- OK (625 out of 1217, remaining: 04:26)
test 0918...[SMTP with multiple and invalid --mail-rcpt]
-p----e--- OK (626 out of 1217, remaining: 04:25)
test 0919...[SMTP plain authentication with initial response]
-p-u--e--- OK (627 out of 1217, remaining: 04:24)
test 0920...[SMTP login authentication with initial response]
-p-u--e--- OK (628 out of 1217, remaining: 04:23)
test 0921...[SMTP NTLM authentication with initial response]
-p-u--e--- OK (629 out of 1217, remaining: 04:23)
test 0922...[SMTP OAuth 2.0 (XOAUTH2) authentication with initial response]
-p-u--e--- OK (630 out of 1217, remaining: 04:22)
test 0923...[SMTP VRFY]
-pd---e--- OK (631 out of 1217, remaining: 04:21)
test 0924...[SMTP ambiguous VRFY]
-pd---e--- OK (632 out of 1217, remaining: 04:20)
test 0925...[SMTP external VRFY]
-pd---e--- OK (633 out of 1217, remaining: 04:19)
test 0926...[SMTP unknown user VRFY]
-p----e--- OK (634 out of 1217, remaining: 04:19)
test 0927...[SMTP mailing list EXPN (CUSTOMREQUEST)]
-pd---e--- OK (635 out of 1217, remaining: 04:18)
test 0928...[SMTP HELP]
-pd---e--- OK (636 out of 1217, remaining: 04:17)
test 0929...[SMTP NOOP (CUSTOMREQUEST)]
-p----e--- OK (637 out of 1217, remaining: 04:16)
test 0930...[SMTP RSET (CUSTOMREQUEST)]
-p----e--- OK (638 out of 1217, remaining: 04:16)
test 0931...[SMTP with URL-encoded CR LF in the URL]
------e--- OK (639 out of 1217, remaining: 04:15)
test 0932...[SMTP CRAM-MD5 graceful cancellation]
-p----e--- OK (640 out of 1217, remaining: 04:14)
test 0933...[SMTP NTLM graceful cancellation]
-p----e--- OK (641 out of 1217, remaining: 04:13)
test 0934...[SMTP DIGEST-MD5 graceful cancellation]
-p----e--- OK (642 out of 1217, remaining: 04:13)
test 0935...[SMTP CRAM-MD5 authentication with SASL downgrade]
-p-u--e--- OK (643 out of 1217, remaining: 04:12)
test 0936...[SMTP NTLM authentication with SASL downgrade]
-p-u--e--- OK (644 out of 1217, remaining: 04:11)
test 0937...[SMTP DIGEST-MD5 authentication with SASL downgrade]
-p-u--e--- OK (645 out of 1217, remaining: 04:11)
test 0939...[RFC821-only SMTP with username and password]
-p-u--e--- OK (646 out of 1217, remaining: 04:10)
test 0940...[SMTP with username and password but no AUTH capability]
-p-u--e--- OK (647 out of 1217, remaining: 04:09)
test 0941...[SMTP with --crlf]
-p-u--e--- OK (648 out of 1217, remaining: 04:08)
test 0942...[SMTP external authentication]
-p-u--e--- OK (649 out of 1217, remaining: 04:08)
test 0943...[SMTP external authentication without credentials]
-p-u--e--- OK (650 out of 1217, remaining: 04:07)
test 0944...[SMTP external authentication with initial response]
-p-u--e--- OK (651 out of 1217, remaining: 04:06)
test 0945...[SMTP external authentication with initial response without credentials]
-p-u--e--- OK (652 out of 1217, remaining: 04:05)
test 0946...[SMTP OAuth 2.0 (OAUTHBEARER) authentication]
-p-u--e--- OK (653 out of 1217, remaining: 04:05)
test 0947...[SMTP OAuth 2.0 (OAUTHBEARER) authentication with initial response]
-p-u--e--- OK (654 out of 1217, remaining: 04:04)
test 0948...[SMTP OAuth 2.0 (OAUTHBEARER) failure as continuation]
-p----e--- OK (655 out of 1217, remaining: 04:03)
test 0949...[SMTP OAuth 2.0 (OAUTHBEARER) failure as continuation with initial response]
-p----e--- OK (656 out of 1217, remaining: 04:03)
test 0950...[SMTP VRFY with custom request]
-pd---e--- OK (657 out of 1217, remaining: 04:02)
test 0951...[SMTP data with dot as first character]
-p-u--e--- OK (658 out of 1217, remaining: 04:01)
test 0952...[SMTP data with single dot-only line]
-p-u--e--- OK (659 out of 1217, remaining: 04:00)
test 1000...[FTP dir list PASV with -I]
-p----e--- OK (660 out of 1217, remaining: 04:00)
test 1003...[FTP with excessively large server command response line]
-pd---e--- OK (663 out of 1217, remaining: 03:57)
test 1005...[FTP with excessively large number of server command response lines]
-pd---e--- OK (665 out of 1217, remaining: 03:56)
test 1006...[FTP with excessively large number of server command response lines (boundary condition)]
-pd---e--- OK (666 out of 1217, remaining: 03:55)
test 1007...[TFTP send with invalid permission on server]
-p----e--- OK (667 out of 1217, remaining: 03:55)
test 1009...[TFTP retrieve with --local-port]
-pd---e--- OK (669 out of 1217, remaining: 03:53)
test 1010...[FTP dir list nocwd]
-pd---e--- OK (670 out of 1217, remaining: 03:52)
test 1011...[HTTP POST with 301 redirect]
-pd---e--- OK (671 out of 1217, remaining: 03:52)
test 1012...[HTTP POST with 301 redirect and --post301]
-pd---e--- OK (672 out of 1217, remaining: 03:51)
test 1013...[Compare curl --version with curl-config --protocols]
------e--- OK (673 out of 1217, remaining: 03:50)
test 1014...[Compare curl --version with curl-config --features]
------e--- OK (674 out of 1217, remaining: 03:50)
test 1015...[--data-urlencode]
-pd---e--- OK (675 out of 1217, remaining: 03:49)
test 1016...[X-Y range on a file:// URL to stdout]
s-----e--- OK (676 out of 1217, remaining: 03:48)
test 1017...[0-Y range on a file:// URL to stdout]
s-----e--- OK (677 out of 1217, remaining: 03:48)
test 1018...[X-X range on a file:// URL to stdout]
s-----e--- OK (678 out of 1217, remaining: 03:47)
test 1019...[X- range on a file:// URL to stdout]
s-----e--- OK (679 out of 1217, remaining: 03:46)
test 1020...[-Y range on a file:// URL to stdout]
s-----e--- OK (680 out of 1217, remaining: 03:45)
test 1022...[Compare curl --version with curl-config --version]
------e--- OK (682 out of 1217, remaining: 03:44)
test 1023...[Compare curl --version with curl-config --vernum]
------e--- OK (683 out of 1217, remaining: 03:43)
test 1024...[HTTP Location: following with cookies]
-pd---e--- OK (684 out of 1217, remaining: 03:43)
test 1025...[HTTP Location: following with command-line and server cookies]
-pd---e--- OK (685 out of 1217, remaining: 03:42)
test 1026...[curl --manual ]
------e--- OK (686 out of 1217, remaining: 03:41)
test 1027...[curl --help]
------e--- OK (687 out of 1217, remaining: 03:40)
test 1028...[HTTP Location: redirect to FTP URL]
sp----e--- OK (688 out of 1217, remaining: 03:40)
test 1029...[HTTP Location: and 'redirect_url' check]
sp----e--- OK (689 out of 1217, remaining: 03:39)
test 1030...[HTTP PUT with --anyauth authorization (picking Digest)]
-pd---e--- OK (690 out of 1217, remaining: 03:40)
test 1031...[HTTP Location: following to a query string]
-pd---e--- OK (691 out of 1217, remaining: 03:39)
test 1032...[HTTP HEAD with --range]
-pd---e--- OK (692 out of 1217, remaining: 03:39)
test 1033...[HTTP GET with 102 response!]
-pd---e--- OK (693 out of 1217, remaining: 03:38)
test 1034 SKIPPED: curl lacks idn support
test 1035 SKIPPED: curl lacks idn support
test 1036...[FTP download resume from end of file]
-p---oe--- OK (696 out of 1217, remaining: 03:36)
test 1037...[FTP download resume from end of empty file]
-p----e--- OK (697 out of 1217, remaining: 03:35)
test 1038...[FTP PASV upload resume from end of file]
-p-u--e--- OK (698 out of 1217, remaining: 03:35)
test 1039...[FTP PASV upload resume from end of empty file]
-p-u--e--- OK (699 out of 1217, remaining: 03:34)
test 1040...[HTTP GET with resume from end of entirely-downloaded file]
-pd---e--- OK (700 out of 1217, remaining: 03:33)
test 1041...[HTTP PUT with resume from end of already-uploaded file]
-pd---e--- OK (701 out of 1217, remaining: 03:33)
test 1042...[HTTP GET beyond end of entirely-downloaded file, no server resume]
-pd---e--- OK (702 out of 1217, remaining: 03:33)
test 1043...[HTTP GET with resume from end of file]
-pd---e--- OK (703 out of 1217, remaining: 03:32)
test 1044...[FTP download large file info with -I]
sp----e--- OK (704 out of 1217, remaining: 03:31)
test 1045...[HTTP GET with numeric localhost --interface]
-pd---e--- OK (705 out of 1217, remaining: 03:31)
test 1046...[HTTP-IPv6 GET with numeric localhost --interface]
-pd---e--- OK (706 out of 1217, remaining: 03:30)
test 1047...[FTP dir list PASV with localhost --interface]
-pd---e--- OK (707 out of 1217, remaining: 03:29)
test 1048...[FTP-IPv6 dir list PASV with localhost --interface]
-pd---e--- OK (708 out of 1217, remaining: 03:29)
test 1049...[TFTP retrieve with localhost --interface]
-pd---e--- OK (709 out of 1217, remaining: 03:28)
test 1050...[FTP-IPv6 dir list, EPRT with specified IP]
-pd---e--- OK (710 out of 1217, remaining: 03:27)
test 1051...[HTTP PUT with Location: following]
-pd---e--- OK (711 out of 1217, remaining: 03:28)
test 1052...[HTTP 1.0 PUT with Location: following]
-pd---e--- OK (712 out of 1217, remaining: 03:28)
test 1053...[HTTP RFC1867-type formposting from file with Location: following]
-pd---e--- OK (713 out of 1217, remaining: 03:27)
test 1054...[HTTP POST from file with 301 redirect and --post301]
-pd---e--- OK (714 out of 1217, remaining: 03:26)
test 1055...[HTTP PUT Location: redirect to FTP URL]
-pdu--e--- OK (715 out of 1217, remaining: 03:27)
test 1056...[HTTP follow redirect from IPv4 to IPv6 with scope]
-pd---e--- OK (716 out of 1217, remaining: 03:26)
test 1057...[FTP retrieve a byte-range relative to end of file]
-pd---e--- OK (717 out of 1217, remaining: 03:25)
test 1058...[HTTP range relative to end of file]
-pd---e--- OK (718 out of 1217, remaining: 03:25)
test 1062...[FTP with excessively long server command response lines, boundary condition]
-pd---e--- OK (722 out of 1217, remaining: 03:22)
test 1063...[Invalid large X- range on a file://]
------e--- OK (723 out of 1217, remaining: 03:21)
test 1064...[HTTP PUT twice]
sp----e--- OK (724 out of 1217, remaining: 03:21)
test 1065...[HTTP PUT with one file but two URLs]
sp----e--- OK (725 out of 1217, remaining: 03:20)
test 1066...[HTTP --dump-header - with two URLs]
sp----e--- OK (726 out of 1217, remaining: 03:19)
test 1067...[HTTP Location: following with auto-referer]
-pd---e--- OK (727 out of 1217, remaining: 03:19)
test 1068...[HTTP PUT from stdin]
-pd---e--- OK (728 out of 1217, remaining: 03:19)
test 1069...[HTTP 1.0 PUT from stdin with no content length]
------e--- OK (729 out of 1217, remaining: 03:18)
test 1070...[HTTP POST with server closing connection before (all) data is received]
-pd---e--- OK (730 out of 1217, remaining: 03:18)
test 1071...[Downgraded HTTP PUT to HTTP 1.0 with authorization]
-pd---e--- OK (731 out of 1217, remaining: 03:18)
test 1072...[HTTP chunked PUT to HTTP 1.0 server with authorization]
-pd---e--- OK (732 out of 1217, remaining: 03:18)
test 1073...[HTTP chunked PUT to HTTP 1.0 server with redirect]
-pd---e--- OK (733 out of 1217, remaining: 03:18)
test 1074...[HTTP downgrade to HTTP/1.0 on second request]
sp----e--- OK (734 out of 1217, remaining: 03:19)
test 1075...[HTTP PUT with --anyauth authorization (picking Basic)]
-pd---e--- OK (735 out of 1217, remaining: 03:20)
test 1076...[HTTP POST with 302 redirect and --post302]
-pd---e--- OK (736 out of 1217, remaining: 03:19)
test 1079...[HTTP retry after closed connection and empty response]
-pd---e--- OK (739 out of 1217, remaining: 03:17)
test 1080...[HTTP Location: on two URLs 'redirect_url' check]
sp----e--- OK (740 out of 1217, remaining: 03:17)
test 1081...[HTTP no Location: on second URL 'redirect_url' check]
sp----e--- OK (741 out of 1217, remaining: 03:16)
test 1082...[HTTP GET with localhost --interface]
-pd---e--- OK (742 out of 1217, remaining: 03:16)
test 1083...[HTTP-IPv6 GET with ip6-localhost --interface]
-pd---e--- OK (743 out of 1217, remaining: 03:15)
test 1084...[HTTP GET with invalid --interface]
------e--- OK (744 out of 1217, remaining: 03:14)
test 1085...[HTTP-IPv6 GET with invalid --interface]
------e--- OK (745 out of 1217, remaining: 03:14)
test 1086...[FTP download with strict timeout and slow data transfer]
-p----e--- OK (746 out of 1217, remaining: 03:21)
test 1089...[HTTP GET --write-out with redirected fetch]
sp----e--- OK (749 out of 1217, remaining: 03:19)
test 1090...[HTTP GET --write-out with redirected fetch and chunked reply]
sp----e--- OK (750 out of 1217, remaining: 03:19)
test 1091...[FTP URL with type=i]
-pd---e--- OK (751 out of 1217, remaining: 03:19)
test 1093...[TFTP retrieve with mode=i]
-pd---e--- OK (753 out of 1217, remaining: 03:18)
test 1094...[TFTP retrieve with mode=netascii]
-pd---e--- OK (754 out of 1217, remaining: 03:17)
test 1095...[HTTP with Digest and realm with quoted quotes]
-pd---e--- OK (755 out of 1217, remaining: 03:17)
test 1096...[Two FTP downloads, with failed RETR but re-used control connection]
-p----e--- OK (756 out of 1217, remaining: 03:16)
test 1099...[TFTP get first a non-existing file then an existing]
sp----e--- OK (759 out of 1217, remaining: 03:14)
test 1100...[HTTP POST with NTLM authorization and following a 302 redirect]
-pd---e--- OK (760 out of 1217, remaining: 03:13)
test 1101...[NO_PROXY test, with user name in URL]
-pd---e--- OK (761 out of 1217, remaining: 03:13)
test 1102...[FTP OS/400 server name format check]
-p----e--- OK (762 out of 1217, remaining: 03:12)
test 1103...[FTP non-OS/400 server]
-p----e--- OK (763 out of 1217, remaining: 03:12)
test 1105...[HTTP with cookie parser and header recording]
-pd--oe--- OK (765 out of 1217, remaining: 03:10)
test 1107...[FTP RETR PASV with PRET]
-pd---e--- OK (767 out of 1217, remaining: 03:09)
test 1108...[FTP RETR PASV with PRET not supported]
-p----e--- OK (768 out of 1217, remaining: 03:08)
test 1109...[HTTP GET with URL that contains fragment after the path]
-pd---e--- OK (769 out of 1217, remaining: 03:08)
test 1110...[HTTP GET with URL that contains a fragment after the query part]
-pd---e--- OK (770 out of 1217, remaining: 03:07)
test 1111...[HTTP GET with URL whose fragment contains a # (which is illegal)]
-pd---e--- OK (771 out of 1217, remaining: 03:06)
test 1112...[FTPS download with strict timeout and slow data transfer]
-p----e--- OK (772 out of 1217, remaining: 03:20)
test 1113...[FTP wildcard download - changed fnmatch, 2x perform (DOS LIST response)]
sp----e--- OK (773 out of 1217, remaining: 03:21)
test 1114...[FTP wildcard download - skip/parser_correctness/CURLOPT_FNMATCH_FUNCTION (DOS)]
s-----e--- OK (774 out of 1217, remaining: 03:20)
test 1115...[HTTP GET with unexpected 1xx response]
-pd---e--- OK (775 out of 1217, remaining: 03:20)
test 1116...[HTTP GET with chunked trailer without Trailer:]
-pd--oe--- OK (776 out of 1217, remaining: 03:19)
test 1117...[HTTP with invalid range then another URL]
sp----e--- OK (777 out of 1217, remaining: 03:31)
test 1118...[URL without slash and @-letter in query]
-pd---e--- OK (778 out of 1217, remaining: 03:31)
test 1119...[Verify that symbols-in-versions and headers are in sync]
------e--- OK (779 out of 1217, remaining: 03:30)
test 1120...[FTP with 421 timeout response]
-p----e--- OK (780 out of 1217, remaining: 03:29)
test 1121...[HTTP multiple provided Host: headers]
-pd---e--- OK (781 out of 1217, remaining: 03:29)
test 1122...[HTTP GET gzip transfer-encoded content]
-pd---e--- OK (782 out of 1217, remaining: 03:28)
test 1123...[HTTP GET deflate transfer-encoded content]
-pd---e--- OK (783 out of 1217, remaining: 03:27)
test 1124...[HTTP GET gzip+chunked transfer-encoded content]
-pd---e--- OK (784 out of 1217, remaining: 03:26)
test 1125...[HTTP GET transfer-encoding with custom Connection:]
-pd---e--- OK (785 out of 1217, remaining: 03:26)
test 1126...[HTTP 200 If-Modified-Since with newer document]
-pd---e--- OK (786 out of 1217, remaining: 03:25)
test 1127...[HTTP 200 If-Modified-Since with older document]
-pd---e--- OK (787 out of 1217, remaining: 03:24)
test 1128...[HTTP 200 If-Modified-Since with old+new documents]
sp----e--- OK (788 out of 1217, remaining: 03:24)
test 1129...[HTTP POST expect 100-continue with a 404]
sp----e--- OK (789 out of 1217, remaining: 03:23)
test 1130...[HTTP POST forced expect 100-continue with a 404]
sp----e--- OK (790 out of 1217, remaining: 03:22)
test 1131...[HTTP PUT expect 100-continue with a 400]
sp----e--- OK (791 out of 1217, remaining: 03:21)
test 1132...[Verify memory #include files in libcurl's C source files]
------e--- OK (792 out of 1217, remaining: 03:21)
test 1133...[HTTP RFC1867-type formposting with filename/data contains ',', ';', '"']
-pd---e--- OK (793 out of 1217, remaining: 03:21)
test 1134...[HTTP connection re-use with different credentials]
-pd---e--- OK (794 out of 1217, remaining: 03:20)
test 1135...[Verify CURL_EXTERN order]
s-----e--- OK (795 out of 1217, remaining: 03:20)
test 1136 SKIPPED: curl lacks PSL support
test 1137...[FTP RETR --ignore-content-length]
-pd---e--- OK (797 out of 1217, remaining: 03:18)
test 1138...[HTTP redirect with UTF-8 characters]
-pd---e--- OK (798 out of 1217, remaining: 03:18)
test 1139...[Verify that all libcurl options have man pages]
------e--- OK (799 out of 1217, remaining: 03:17)
test 1140...[Verify the nroff of man pages]
------e--- OK (800 out of 1217, remaining: 03:18)
test 1143...[HTTP URL with http:/ (one slash!)]
-pd---e--- OK (803 out of 1217, remaining: 03:16)
test 1144...[HTTP HEAD, receive no headers only body]
-pd---e--- OK (804 out of 1217, remaining: 03:15)
test 1145...[file:// bad host]
------e--- OK (805 out of 1217, remaining: 03:14)
test 1146...[--proto-default file]
--d---e--- OK (806 out of 1217, remaining: 03:14)
test 1147...[Get -H headers from a file]
-pd---e--- OK (807 out of 1217, remaining: 03:13)
test 1148...[progress-bar]
-pd--oe--- OK (808 out of 1217, remaining: 03:12)
test 1149...[FTP dir list multicwd then again nocwd]
-pd---e--- OK (809 out of 1217, remaining: 03:12)
test 1151...[HTTP with too long cookies]
-pd--oe--- OK (811 out of 1217, remaining: 03:10)
test 1152...[FTP with uneven quote in PWD response]
-pd---e--- OK (812 out of 1217, remaining: 03:10)
test 1153...[FTP with quoted double quotes]
-pd---e--- OK (813 out of 1217, remaining: 03:09)
test 1154...[HTTP GET]
-p----e--- OK (814 out of 1217, remaining: 03:08)
test 1155...[HTTP cookie with parameter word as name]
-pd--oe--- OK (815 out of 1217, remaining: 03:08)
test 1156...[HTTP resume/range fail range-error content-range combinations]
------e--- OK (816 out of 1217, remaining: 03:07)
test 1157...[Get -H headers from empty file]
-pd---e--- OK (817 out of 1217, remaining: 03:06)
test 1158...[HTTP RFC1867-type formposting with filename containing '"']
-pd---e--- OK (818 out of 1217, remaining: 03:06)
test 1159...[HTTP Location: and 'redirect_url' with non-supported scheme]
sp----e--- OK (819 out of 1217, remaining: 03:05)
test 1160...[HTTP with long funny format cookie]
-pd--oe--- OK (820 out of 1217, remaining: 03:04)
test 1161...[HTTP cookie with path set twice]
-pd--oe--- OK (821 out of 1217, remaining: 03:04)
test 1162...[FTP wildcard with crazy pattern]
-p----e--- OK (822 out of 1217, remaining: 03:03)
test 1163...[FTP wildcard with pattern ending with an open-bracket]
-p----e--- OK (823 out of 1217, remaining: 03:02)
test 1164...[HTTP/0.9 GET and all zeroes]
sp----e--- OK (824 out of 1217, remaining: 03:02)
test 1170...[HTTP GET transfer-encoding with removed Connection:]
-pd---e--- OK (825 out of 1217, remaining: 03:01)
test 1171...[HTTP GET transfer-encoding with blanked Connection:]
-pd---e--- OK (826 out of 1217, remaining: 03:01)
test 1172...[HTTP/0.9 GET response denied]
-p----e--- OK (827 out of 1217, remaining: 03:00)
test 1200...[Gopher index]
-pd---e--- OK (828 out of 1217, remaining: 03:00)
test 1201...[Gopher selector]
-pd---e--- OK (829 out of 1217, remaining: 03:00)
test 1202...[Gopher query]
-pd---e--- OK (830 out of 1217, remaining: 02:59)
test 1203...[Gopher IPv6 index]
-pd---e--- OK (831 out of 1217, remaining: 02:59)
test 1204...[HTTP with WWW-Authenticate and multiple auths in a single line]
-pd---e--- OK (832 out of 1217, remaining: 02:59)
test 1205...[HTTP GET with 18K HTTP header]
-pd---e--- OK (833 out of 1217, remaining: 02:58)
test 1206...[FTP PORT and 425 on download]
-p----e--- OK (834 out of 1217, remaining: 02:57)
test 1207...[FTP PORT and 421 on download]
-p----e--- OK (835 out of 1217, remaining: 02:57)
test 1208...[FTP PORT download, no data conn and no transient negative reply]
-p----e--- OK (836 out of 1217, remaining: 02:57)
test 1210...[HTTP GET with -J without Content-Disposition]
-p---oe--- OK (837 out of 1217, remaining: 02:56)
test 1217...[FTP with rubbish before name in 257-response]
-pd---e--- OK (843 out of 1217, remaining: 02:52)
test 1219...[FTP with no user+password required (230 response)]
-pd---e--- OK (845 out of 1217, remaining: 02:51)
test 1220...[file:// URLs with query string]
s-----e--- OK (846 out of 1217, remaining: 02:51)
test 1221...[10 chars object name generation testing]
-----oe--- OK (847 out of 1217, remaining: 02:50)
test 1222...[8 chars object name generation testing]
-----oe--- OK (848 out of 1217, remaining: 02:50)
test 1223...[HTTP GET -w remote_ip and -w remote_port]
sp----e--- OK (849 out of 1217, remaining: 02:49)
test 1224...[FTP fetch a file from the root directory]
-pd---e--- OK (850 out of 1217, remaining: 02:48)
test 1225...[FTP fetch two files using absolute paths]
-pd---e--- OK (851 out of 1217, remaining: 02:48)
test 1226...[FTP fetch a file from the root directory with singlecwd]
-pd---e--- OK (852 out of 1217, remaining: 02:47)
test 1227...[FTP fetch a file from the root directory with nocwd]
-pd---e--- OK (853 out of 1217, remaining: 02:47)
test 1229...[HTTP with Digest authorization with user name needing escape]
-pd---e--- OK (855 out of 1217, remaining: 02:45)
test 1231...[HTTP URL with dotdot removal from path]
-pd---e--- OK (857 out of 1217, remaining: 02:44)
test 1233...[FTP failing to connect to EPSV port, switching to PASV]
-pd---e--- OK (859 out of 1217, remaining: 02:43)
test 1234...[abusing {}-globbing]
------e--- OK (860 out of 1217, remaining: 02:42)
test 1235...[multiple requests using {}{} in the URL]
sp----e--- OK (861 out of 1217, remaining: 02:42)
test 1236...[[] globbing overflowing the range counter]
------e--- OK (862 out of 1217, remaining: 02:41)
test 1237...[URL with 1000+ letter user name + password]
-pd---e--- OK (863 out of 1217, remaining: 02:40)
test 1238...[slow TFTP retrieve cancel due to -Y and -y]
-p----e--- OK (864 out of 1217, remaining: 02:41)
test 1239...[HTTP with -z + -w response_code and simulated 304]
sp----e--- OK (865 out of 1217, remaining: 02:41)
test 1240...[glob [0-1] with stuff after range (7.33.0 regression)]
-pd---e--- OK (866 out of 1217, remaining: 02:40)
test 1242...[TFTP retrieve without TFTP options requests]
-pd---e--- OK (868 out of 1217, remaining: 02:39)
test 1243...[TFTP send without TFTP options requests]
-p-u--e--- OK (869 out of 1217, remaining: 02:40)
test 1245...[--proto deny must override --proto-redir allow]
-pd---e--- OK (871 out of 1217, remaining: 02:39)
test 1247...[--fail-early]
------e--- OK (873 out of 1217, remaining: 02:38)
test 1258...[HTTP, use cookies with localhost]
-pd---e--- OK (884 out of 1217, remaining: 02:31)
test 1259...[HTTP URL with semicolon in password]
-pd---e--- OK (885 out of 1217, remaining: 02:30)
test 1260...[HTTP URL with rubbish after port number]
------e--- OK (886 out of 1217, remaining: 02:30)
test 1261...['redirect_url' with --location and --max-redir]
sp----e--- OK (887 out of 1217, remaining: 02:29)
test 1262...[FTP request and denied to download an older file with -z]
-p----e--- OK (888 out of 1217, remaining: 02:29)
test 1263...[HTTP URL with rubbish after IPv6 bracket]
------e--- OK (889 out of 1217, remaining: 02:28)
test 1264...[HTTP URL with space in host name]
------e--- OK (890 out of 1217, remaining: 02:27)
test 1266...[HTTP GET with a single-byte HTTP/0.9 response]
-pd---e--- OK (892 out of 1217, remaining: 02:26)
test 1267...[HTTP GET with a invalid HTTP/1 response line start]
-pd---e--- OK (893 out of 1217, remaining: 02:26)
test 1268...[file name argument looks like a flag]
-----oe--- OK (894 out of 1217, remaining: 02:25)
test 1280...[simple [a-d] globbing]
-pd---e--- OK (895 out of 1217, remaining: 02:24)
test 1281...[reject non-numerical port number in URL]
------e--- OK (896 out of 1217, remaining: 02:24)
test 1282 SKIPPED: curl lacks GSS-API support
test 1283...[globbing range with same start and stop]
-p---oe--- OK (898 out of 1217, remaining: 02:23)
test 1284...[HTTP POST --digest with user-specified Content-Length header]
-pd---e--- OK (899 out of 1217, remaining: 02:22)
test 1285...[HTTP PUT --digest with user-specified Content-Length header]
-pd---e--- OK (900 out of 1217, remaining: 02:22)
test 1286...[HTTP GET --digest increasing nonce-count]
-pd---e--- OK (901 out of 1217, remaining: 02:21)
test 1289...[globbing with overflow and bad syntxx]
------e--- OK (904 out of 1217, remaining: 02:19)
test 1290...[Verify URL globbing ignores []]
-pd---e--- OK (905 out of 1217, remaining: 02:19)
test 1291...[Attempt to upload 100K files but fail immediately]
------e--- OK (906 out of 1217, remaining: 02:20)
test 1292...[Replaced internal headers with a blank one]
-pd---e--- OK (907 out of 1217, remaining: 02:19)
test 1298...[HTTP GET special path with --request-target]
-pd---e--- OK (908 out of 1217, remaining: 02:19)
test 1299...[Send "OPTIONS *" with --request-target]
-pd---e--- OK (909 out of 1217, remaining: 02:18)
test 1300...[llist unit tests]
------e--- OK (910 out of 1217, remaining: 02:18)
test 1301...[curl_strcasecompare unit tests]
------e--- OK (911 out of 1217, remaining: 02:17)
test 1302...[base64 encode/decode unit tests]
------e--- OK (912 out of 1217, remaining: 02:16)
test 1303...[Curl_timeleft unit tests]
------e--- OK (913 out of 1217, remaining: 02:16)
test 1304...[netrc parsing unit tests]
------e--- OK (914 out of 1217, remaining: 02:15)
test 1305...[internal hash create/destroy testing]
------e--- OK (915 out of 1217, remaining: 02:15)
test 1306...[internal hash create/add/destroy testing]
------e--- OK (916 out of 1217, remaining: 02:14)
test 1308...[formpost unit tests]
------e--- OK (917 out of 1217, remaining: 02:14)
test 1309...[splay unit tests]
s-----e--- OK (918 out of 1217, remaining: 02:13)
test 1310...[HTTP with NTLM delegation to winbind helper]
-pd---e--- OK (919 out of 1217, remaining: 02:12)
test 1311...[HTTP GET with -J and Content-Disposition]
-p---oe--- OK (920 out of 1217, remaining: 02:12)
test 1312...[HTTP GET with -J, Content-Disposition and ; in filename]
-p---oe--- OK (921 out of 1217, remaining: 02:11)
test 1313...[HTTP GET with -J, Content-Disposition, uneven quotes]
-p---oe--- OK (922 out of 1217, remaining: 02:11)
test 1315...[HTTP RFC1867-type formposting - -F with three files, one with explicit type]
-pd---e--- OK (924 out of 1217, remaining: 02:10)
test 1317...[HTTP with --resolve]
-pd---e--- OK (925 out of 1217, remaining: 02:09)
test 1318...[HTTP with --resolve and same host name using different cases]
-pd---e--- OK (926 out of 1217, remaining: 02:08)
test 1322...[HTTP with --resolve and hostname with trailing dot]
-pd---e--- OK (930 out of 1217, remaining: 02:06)
test 1323...[curlx_tvdiff]
------e--- OK (931 out of 1217, remaining: 02:06)
test 1324...[HTTP with --resolve and [ipv6address]]
-pd---e--- OK (932 out of 1217, remaining: 02:05)
test 1325...[HTTP 308-redirect with POST]
-pd---e--- OK (933 out of 1217, remaining: 02:04)
test 1326...[TELNET to HTTP server]
-pd---e--- OK (934 out of 1217, remaining: 02:04)
test 1327...[TELNET check of upload with stdout redirected]
-p----e--- OK (935 out of 1217, remaining: 02:03)
test 1328...[HTTP GET a globbed range with -f]
-pd---e--- OK (936 out of 1217, remaining: 02:03)
test 1330 SKIPPED: curl lacks TrackMemory support
test 1332...[HTTP POST with 303 redirect and --post303]
-pd---e--- OK (940 out of 1217, remaining: 02:01)
test 1333...[HTTP POST zero length, chunked-encoded]
-pd---e--- OK (941 out of 1217, remaining: 02:00)
test 1334...[HTTP GET with -O without Content-Disposition, -D file]
-p---oe--- OK (942 out of 1217, remaining: 02:00)
test 1335...[HTTP GET with -O without Content-Disposition, -D stdout]
-p---oe--- OK (943 out of 1217, remaining: 01:59)
test 1336...[HTTP GET with -O and Content-Disposition, -D file]
-p---oe--- OK (944 out of 1217, remaining: 01:58)
test 1337...[HTTP GET with -O and Content-Disposition, -D stdout]
-p---oe--- OK (945 out of 1217, remaining: 01:58)
test 1338...[HTTP GET with -O -J without Content-Disposition, -D file]
-p---oe--- OK (946 out of 1217, remaining: 01:57)
test 1339...[HTTP GET with -O -J without Content-Disposition, -D stdout]
-p---oe--- OK (947 out of 1217, remaining: 01:57)
test 1340...[HTTP GET with -O -J and Content-Disposition, -D file]
-p---oe--- OK (948 out of 1217, remaining: 01:56)
test 1341...[HTTP GET with -O -J and Content-Disposition, -D stdout]
-p---oe--- OK (949 out of 1217, remaining: 01:56)
test 1342...[HTTP GET with -O -i without Content-Disposition, -D file]
-p---oe--- OK (950 out of 1217, remaining: 01:55)
test 1343...[HTTP GET with -O -i without Content-Disposition, -D stdout]
-p---oe--- OK (951 out of 1217, remaining: 01:55)
test 1344...[HTTP GET with -O -i and Content-Disposition, -D file]
-p---oe--- OK (952 out of 1217, remaining: 01:54)
test 1345...[HTTP GET with -O -i and Content-Disposition, -D stdout]
-p---oe--- OK (953 out of 1217, remaining: 01:54)
test 1346...[HTTP GET with -O -i without Content-Disposition, without -D]
-p---oe--- OK (954 out of 1217, remaining: 01:53)
test 1347...[HTTP GET with -O -i and Content-Disposition, without -D]
-p---oe--- OK (955 out of 1217, remaining: 01:53)
test 1348...[FTP download, file without Content-Disposition inside, using -O]
-p---oe--- OK (956 out of 1217, remaining: 01:52)
test 1349...[FTP download, file without C-D inside, using -O -D file]
-p---oe--- OK (957 out of 1217, remaining: 01:52)
test 1350...[FTP download, file without C-D inside, using -O -D stdout]
-p---oe--- OK (958 out of 1217, remaining: 01:51)
test 1351...[FTP download, file without C-D inside, using -O -J -D file]
-p---oe--- OK (959 out of 1217, remaining: 01:50)
test 1352...[FTP download, file without C-D inside, using -O -J -D stdout]
-p---oe--- OK (960 out of 1217, remaining: 01:50)
test 1353...[FTP download, file without C-D inside, using -O -i -D file]
-p---oe--- OK (961 out of 1217, remaining: 01:49)
test 1354...[FTP download, file without C-D inside, using -O -i -D stdout]
-p---oe--- OK (962 out of 1217, remaining: 01:49)
test 1355...[FTP download, file without C-D inside, using -O -i, without -D]
-p---oe--- OK (963 out of 1217, remaining: 01:48)
test 1356...[FTP download, file with Content-Disposition inside, using -O]
-p---oe--- OK (964 out of 1217, remaining: 01:48)
test 1357...[FTP download, file with C-D inside, using -O -D file]
-p---oe--- OK (965 out of 1217, remaining: 01:47)
test 1358...[FTP download, file with C-D inside, using -O -D stdout]
-p---oe--- OK (966 out of 1217, remaining: 01:47)
test 1359...[FTP download, file with C-D inside, using -O -J -D file]
-p---oe--- OK (967 out of 1217, remaining: 01:46)
test 1360...[FTP download, file with C-D inside, using -O -J -D stdout]
-p---oe--- OK (968 out of 1217, remaining: 01:46)
test 1361...[FTP download, file with C-D inside, using -O -i -D file]
-p---oe--- OK (969 out of 1217, remaining: 01:45)
test 1362...[FTP download, file with C-D inside, using -O -i -D stdout]
-p---oe--- OK (970 out of 1217, remaining: 01:45)
test 1363...[FTP download, file with C-D inside, using -O -i, without -D]
-p---oe--- OK (971 out of 1217, remaining: 01:44)
test 1364...[HTTP GET -o fname without Content-Disposition, -D file]
-p---oe--- OK (972 out of 1217, remaining: 01:44)
test 1365...[HTTP GET -o fname without Content-Disposition, -D stdout]
-p---oe--- OK (973 out of 1217, remaining: 01:43)
test 1366...[HTTP GET -o fname and Content-Disposition, -D file]
-p---oe--- OK (974 out of 1217, remaining: 01:43)
test 1367...[HTTP GET -o fname and Content-Disposition, -D stdout]
-p---oe--- OK (975 out of 1217, remaining: 01:42)
test 1368...[HTTP GET -o fname -J without Content-Disposition, -D file]
-p---oe--- OK (976 out of 1217, remaining: 01:42)
test 1369...[HTTP GET -o fname -J without Content-Disposition, -D stdout]
-p---oe--- OK (977 out of 1217, remaining: 01:41)
test 1370...[HTTP GET -o fname -J and Content-Disposition, -D file]
-p---oe--- OK (978 out of 1217, remaining: 01:41)
test 1371...[HTTP GET -o fname -J and Content-Disposition, -D stdout]
-p---oe--- OK (979 out of 1217, remaining: 01:40)
test 1372...[HTTP GET -o fname -i without Content-Disposition, -D file]
-p---oe--- OK (980 out of 1217, remaining: 01:40)
test 1373...[HTTP GET -o fname -i without Content-Disposition, -D stdout]
-p---oe--- OK (981 out of 1217, remaining: 01:39)
test 1374...[HTTP GET -o fname -i and Content-Disposition, -D file]
-p---oe--- OK (982 out of 1217, remaining: 01:39)
test 1375...[HTTP GET -o fname -i and Content-Disposition, -D stdout]
-p---oe--- OK (983 out of 1217, remaining: 01:38)
test 1376...[HTTP GET -o fname -i without Content-Disposition, without -D]
-p---oe--- OK (984 out of 1217, remaining: 01:38)
test 1377...[HTTP GET -o fname -i and Content-Disposition, without -D]
-p---oe--- OK (985 out of 1217, remaining: 01:37)
test 1378...[FTP DL, file without Content-Disposition inside, using -o fname]
-p---oe--- OK (986 out of 1217, remaining: 01:37)
test 1379...[FTP DL, file without C-D inside, using -o fname -D file]
-p---oe--- OK (987 out of 1217, remaining: 01:36)
test 1380...[FTP DL, file without C-D inside, using -o fname -D stdout]
-p---oe--- OK (988 out of 1217, remaining: 01:36)
test 1381...[FTP DL, file without C-D inside, using -o fname -J -D file]
-p---oe--- OK (989 out of 1217, remaining: 01:35)
test 1382...[FTP DL, file without C-D inside, using -o fname -J -D stdout]
-p---oe--- OK (990 out of 1217, remaining: 01:35)
test 1383...[FTP DL, file without C-D inside, using -o fname -i -D file]
-p---oe--- OK (991 out of 1217, remaining: 01:34)
test 1384...[FTP DL, file without C-D inside, using -o fname -i -D stdout]
-p---oe--- OK (992 out of 1217, remaining: 01:34)
test 1385...[FTP DL, file without C-D inside, using -o fname -i, without -D]
-p---oe--- OK (993 out of 1217, remaining: 01:33)
test 1386...[FTP DL, file with Content-Disposition inside, using -o fname]
-p---oe--- OK (994 out of 1217, remaining: 01:33)
test 1387...[FTP DL, file with C-D inside, using -o fname -D file]
-p---oe--- OK (995 out of 1217, remaining: 01:32)
test 1388...[FTP DL, file with C-D inside, using -o fname -D stdout]
-p---oe--- OK (996 out of 1217, remaining: 01:32)
test 1389...[FTP DL, file with C-D inside, using -o fname -J -D file]
-p---oe--- OK (997 out of 1217, remaining: 01:31)
test 1390...[FTP DL, file with C-D inside, using -o fname -J -D stdout]
-p---oe--- OK (998 out of 1217, remaining: 01:31)
test 1391...[FTP DL, file with C-D inside, using -o fname -i -D file]
-p---oe--- OK (999 out of 1217, remaining: 01:30)
test 1392...[FTP DL, file with C-D inside, using -o fname -i -D stdout]
-p---oe--- OK (1000 out of 1217, remaining: 01:30)
test 1393...[FTP DL, file with C-D inside, using -o fname -i, without -D]
-p---oe--- OK (1001 out of 1217, remaining: 01:29)
test 1394...[unit test for parse_cert_parameter()]
------e--- OK (1002 out of 1217, remaining: 01:29)
test 1395...[Curl_dedotdotify]
------e--- OK (1003 out of 1217, remaining: 01:29)
test 1396...[curl_easy_escape and curl_easy_unescape]
------e--- OK (1004 out of 1217, remaining: 01:28)
test 1397...[Check wildcard certificate matching function Curl_cert_hostcheck]
------e--- OK (1005 out of 1217, remaining: 01:28)
test 1398...[curl_msnprintf unit tests]
------e--- OK (1006 out of 1217, remaining: 01:27)
test 1399...[Curl_pgrsTime unit tests]
------e--- OK (1007 out of 1217, remaining: 01:27)
test 1400...[--libcurl for simple HTTP GET]
-pd--oe--- OK (1008 out of 1217, remaining: 01:26)
test 1401...[--libcurl for GET with various options]
-pd--oe--- OK (1009 out of 1217, remaining: 01:26)
test 1402...[--libcurl for simple POST]
-pd--oe--- OK (1010 out of 1217, remaining: 01:25)
test 1403...[--libcurl for GET with query]
-pd--oe--- OK (1011 out of 1217, remaining: 01:25)
test 1404...[--libcurl for HTTP RFC1867-type formposting - -F with 3 files, one with explicit type & encoder]
-pd--oe--- OK (1012 out of 1217, remaining: 01:24)
test 1405...[--libcurl for FTP with quote ops]
-pd--oe--- OK (1013 out of 1217, remaining: 01:24)
test 1406...[--libcurl for SMTP]
-p-u-oe--- OK (1014 out of 1217, remaining: 01:23)
test 1407...[--libcurl for POP3 LIST one message]
-p---oe--- OK (1015 out of 1217, remaining: 01:23)
test 1408...[HTTP receive cookies over IPV6]
-p----e--- OK (1016 out of 1217, remaining: 01:22)
test 1409...[Pass in string to -C]
------e--- OK (1017 out of 1217, remaining: 01:22)
test 1410...[Pass in negative number to --max-time]
------e--- OK (1018 out of 1217, remaining: 01:21)
test 1411...[HTTP with zero size file PUT]
-pd---e--- OK (1019 out of 1217, remaining: 01:21)
test 1412...[HTTP GET with --anyauth with two URLs (picking Digest) ]
-pd---e--- OK (1020 out of 1217, remaining: 01:20)
test 1413...[HTTP redirect with fragment in new URL]
-pd---e--- OK (1021 out of 1217, remaining: 01:20)
test 1414...[FTP PORT without SIZE or EPRT support]
-pd---e--- OK (1022 out of 1217, remaining: 01:19)
test 1416...[HTTP GET with chunked Transfer-Encoding overflowed chunked size]
-p----e--- OK (1024 out of 1217, remaining: 01:18)
test 1417...[HTTP GET with chunked encoding and chunked trailer without CRs]
-pd--oe--- OK (1025 out of 1217, remaining: 01:18)
test 1418...[HTTP with --anyauth and connection re-use]
-pd---e--- OK (1026 out of 1217, remaining: 01:17)
test 1419...[HTTP with --anyauth (but no auth!) and connection re-use]
-pd---e--- OK (1027 out of 1217, remaining: 01:17)
test 1420...[--libcurl for IMAP FETCH message]
-pd--oe--- OK (1028 out of 1217, remaining: 01:17)
test 1422...[HTTP GET with -O -J and Content-Disposition (empty file)]
-p---oe--- OK (1030 out of 1217, remaining: 01:16)
test 1423...[HTTP GET -o fname without Content-Disposition (empty file)]
-p---oe--- OK (1031 out of 1217, remaining: 01:15)
test 1424...[HTTP GET -o fname without Content-Disposition (unmet time condition)]
-p---oe--- OK (1032 out of 1217, remaining: 01:15)
test 1425...[Refuse binary output to terminal]
sp----e--- OK (1033 out of 1217, remaining: 01:14)
test 1426...[Okay binary output to terminal]
sp----e--- OK (1034 out of 1217, remaining: 01:14)
test 1427...[too large -m timeout value]
------e--- OK (1035 out of 1217, remaining: 01:13)
test 1429...[HTTP GET with 4-digit response code]
sp----e--- OK (1037 out of 1217, remaining: 01:12)
test 1430...[HTTP GET with negative response code]
-pd---e--- OK (1038 out of 1217, remaining: 01:12)
test 1431...[HTTP GET with single-digit response code]
-pd---e--- OK (1039 out of 1217, remaining: 01:11)
test 1432...[HTTP GET with 100-digit response code and survive]
-p----e--- OK (1040 out of 1217, remaining: 01:11)
test 1433...[HTTP GET with 100-digit subversion number in response]
-p----e--- OK (1041 out of 1217, remaining: 01:10)
test 1434...[HTTP GET resume at exactly the existing file size is fine]
-pd---e--- OK (1042 out of 1217, remaining: 01:10)
test 1435...[simple HTTP GET over Unix socket]
-pd---e--- OK (1043 out of 1217, remaining: 01:10)
test 1436...[HTTP requests with multiple connections over Unix socket]
sp----e--- OK (1044 out of 1217, remaining: 01:09)
test 1437...[HTTP with duplicated WWW-Authenticate parameters]
-pd---e--- OK (1045 out of 1217, remaining: 01:09)
test 1438...[Check if %{scheme} returns HTTP]
sp----e--- OK (1046 out of 1217, remaining: 01:09)
test 1439...[Check if %{scheme} returns HTTP]
sp----e--- OK (1047 out of 1217, remaining: 01:08)
test 1440...[Check --write-out with trailing %{]
s-----e--- OK (1048 out of 1217, remaining: 01:08)
test 1441...[Check --write-out with trailing %]
s-----e--- OK (1049 out of 1217, remaining: 01:07)
test 1442...[Check --write-out with trailing \]
s-----e--- OK (1050 out of 1217, remaining: 01:07)
test 1443...[HTTP GET with -O and --remote-time]
-p---oe--- OK (1051 out of 1217, remaining: 01:06)
test 1444...[FTP with --remote-time]
-pd---e--- OK (1052 out of 1217, remaining: 01:06)
test 1445...[file:// with --remote-time]
------e--- OK (1053 out of 1217, remaining: 01:05)
test 1449...[FTP download range with integer overflow]
-p----e--- OK (1057 out of 1217, remaining: 01:03)
test 1450...[Basic DICT lookup]
------e--- OK (1058 out of 1217, remaining: 01:03)
test 1451...[Basic SMB request]
------e--- OK (1059 out of 1217, remaining: 01:03)
test 1452...[Basic TELNET negotiation]
------e--- OK (1060 out of 1217, remaining: 01:03)
test 1453...[Too long tftp filename]
------e--- OK (1061 out of 1217, remaining: 01:03)
test 1454 SKIPPED: curl has ipv6 support
test 1455...[HTTP GET when PROXY Protocol enabled]
-p----e--- OK (1063 out of 1217, remaining: 01:02)
test 1456...[HTTP-IPv6 GET with PROXY protocol]
-p----e--- OK (1064 out of 1217, remaining: 01:01)
test 1457...[Check if %{stderr} and %{stdout} switch between stdout and stderr.]
sp----e--- OK (1065 out of 1217, remaining: 01:01)
test 1458...[HTTP with wildcard --resolve]
-pd---e--- OK (1066 out of 1217, remaining: 01:00)
test 1500...[curl_multi_wait]
--d---e--- OK (1067 out of 1217, remaining: 01:00)
test 1501...[FTP with multi interface and slow LIST response ]
-p----e--- OK (1068 out of 1217, remaining: 01:00)
test 1502...[HTTP multi with CURLOPT_RESOLVE, cleanup sequence UA]
-pd---e--- OK (1069 out of 1217, remaining: 01:00)
test 1503...[HTTP multi with CURLOPT_RESOLVE, cleanup sequence PA]
-pd---e--- OK (1070 out of 1217, remaining: 00:59)
test 1504...[HTTP multi with CURLOPT_RESOLVE, cleanup sequence UB]
-pd---e--- OK (1071 out of 1217, remaining: 00:59)
test 1505...[HTTP multi with CURLOPT_RESOLVE, cleanup sequence PB]
-pd---e--- OK (1072 out of 1217, remaining: 00:58)
test 1506...[HTTP GET connection cache limit (CURLMOPT_MAXCONNECTS)]
-p---oe--- OK (1073 out of 1217, remaining: 00:58)
test 1507...[SMTP with multi interface and CURLE_ABORTED_BY_CALLBACK]
-p----e--- OK (1074 out of 1217, remaining: 00:57)
test 1508...[Close a multi handle without using it]
-----oe--- OK (1075 out of 1217, remaining: 00:57)
test 1511...[HTTP GET time conditions in repeated requests]
--d---e--- OK (1077 out of 1217, remaining: 00:56)
test 1513...[return failure immediately from progress callback]
s-----e--- OK (1078 out of 1217, remaining: 00:56)
test 1514...[HTTP POST with read callback and unknown data size]
-p----e--- OK (1079 out of 1217, remaining: 00:55)
test 1515...[caching of manual libcurl DNS entries after DNS cache timeout]
--d---e--- OK (1080 out of 1217, remaining: 00:55)
test 1516...[caching of manual libcurl DNS entries after dead connection]
------e--- OK (1081 out of 1217, remaining: 00:55)
test 1517...[HTTP POST, server responds before completed send]
-pd---e--- OK (1082 out of 1217, remaining: 00:55)
test 1518...[Extract Location: with broken URL]
s-----e--- OK (1083 out of 1217, remaining: 00:54)
test 1519...[Extract Location: with broken absolute URL]
s-----e--- OK (1084 out of 1217, remaining: 00:54)
test 1520...[SMTP with CRLF-dot-CRLF in data]
-p-u--e--- OK (1085 out of 1217, remaining: 00:53)
test 1521...[Test all curl_easy_setopt and curl_easy_getinfo options]
------e--- OK (1086 out of 1217, remaining: 00:53)
test 1522...[CURLINFO_SIZE_UPLOAD with small SO_SNDBUF]
s-----e--- OK (1087 out of 1217, remaining: 00:52)
test 1530...[CURLOPT_OPENSOCKETFUNCTION returns bad socket]
------e--- OK (1093 out of 1217, remaining: 00:50)
test 1531...[CURLOPT_POSTFIELDS with binary data set after multi_add_handle]
-p----e--- OK (1094 out of 1217, remaining: 00:49)
test 1532...[Test CURLINFO_RESPONSE_CODE]
-p----e--- OK (1095 out of 1217, remaining: 00:49)
test 1533...[HTTP with CURLOPT_KEEP_SENDING_ON_ERROR and an early error response]
-p----e--- OK (1096 out of 1217, remaining: 00:48)
test 1534...[CURLINFO_FILETIME init and reset]
-p----e--- OK (1097 out of 1217, remaining: 00:48)
test 1535...[Test CURLINFO_RESPONSE_CODE CURLINFO_PROTOCOL]
-p----e--- OK (1098 out of 1217, remaining: 00:47)
test 1536...[Test CURLINFO_RESPONSE_CODE CURLINFO_SCHEME]
-p----e--- OK (1099 out of 1217, remaining: 00:47)
test 1537...[libcurl URL escape/unescape tests]
s-----e--- OK (1100 out of 1217, remaining: 00:47)
test 1538...[libcurl strerror API call tests]
s-----e--- OK (1101 out of 1217, remaining: 00:46)
test 1540...[chunked with trailers and pausing the receive]
-pd---e--- OK (1102 out of 1217, remaining: 00:46)
test 1550...[verify setting pipeling blacklisting options]
------e--- OK (1103 out of 1217, remaining: 00:45)
test 1551...[re-run redirected transfer without setting URL again]
-pd---e--- OK (1104 out of 1217, remaining: 00:45)
test 1552...[IMAP multi transfer error without curl_multi_remove_handle]
------e--- OK (1105 out of 1217, remaining: 00:44)
test 1553...[IMAP cleanup before a connection was created]
------e--- OK (1106 out of 1217, remaining: 00:44)
test 1554...[HTTP with shared connection cache]
--d---e--- OK (1107 out of 1217, remaining: 00:44)
test 1555...[verify api is protected against calls from callbacks]
s-----e--- OK (1108 out of 1217, remaining: 00:43)
test 1556...[send long HTTP headers to header callback]
sp----e--- OK (1109 out of 1217, remaining: 00:43)
test 1557...[Removing easy handle that's in the pending connections list doesn't leave behind a dangling entry]
------e--- OK (1110 out of 1217, remaining: 00:42)
test 1558...[CURLINFO_PROTOCOL for file:// transfer]
s-----e--- OK (1111 out of 1217, remaining: 00:42)
test 1560 SKIPPED: curl lacks ldap support
test 1561...[Cookies set over HTTP can't override secure ones]
-p---oe--- OK (1113 out of 1217, remaining: 00:41)
test 1562...[Expire secure cookies over HTTPS]
-p----e--- OK (1114 out of 1217, remaining: 00:41)
test 1590...[IMAP cleanup before a connection was created]
------e--- OK (1115 out of 1217, remaining: 00:40)
test 1591...[HTTP PUT with trailers at the end]
-p----e--- OK (1116 out of 1217, remaining: 00:40)
test 1592...[HTTP request, remove handle while resolving, don't block]
------e--- OK (1117 out of 1217, remaining: 00:39)
test 1600...[NTLM unit tests]
------e--- OK (1118 out of 1217, remaining: 00:39)
test 1601...[MD5 unit tests]
------e--- OK (1119 out of 1217, remaining: 00:39)
test 1602...[Internal hash create/add/destroy testing, exercising clean functions]
------e--- OK (1120 out of 1217, remaining: 00:38)
test 1603...[Internal hash add, retrieval, deletion testing]
------e--- OK (1121 out of 1217, remaining: 00:38)
test 1604...[Test WIN32/MSDOS filename sanitization]
------e--- OK (1122 out of 1217, remaining: 00:37)
test 1605...[Test negative data lengths as input to libcurl functions]
------e--- OK (1123 out of 1217, remaining: 00:37)
test 1606...[verify speedcheck]
------e--- OK (1124 out of 1217, remaining: 00:36)
test 1607...[CURLOPT_RESOLVE parsing]
------e--- OK (1125 out of 1217, remaining: 00:36)
test 1608...[verify DNS shuffling]
------e--- OK (1126 out of 1217, remaining: 00:36)
test 1609...[CURLOPT_RESOLVE parsing]
------e--- OK (1127 out of 1217, remaining: 00:35)
test 1620...[unit tests for url.c]
------e--- OK (1128 out of 1217, remaining: 00:35)
test 1621...[unit tests for stripcredentials from URL]
------e--- OK (1129 out of 1217, remaining: 00:34)
test 1650 SKIPPED: curl lacks http/2 support
test 1651...[x509 parsing]
------e--- OK (1131 out of 1217, remaining: 00:33)
test 1652...[infof]
------e--- OK (1132 out of 1217, remaining: 00:33)
test 1653...[urlapi]
------e--- OK (1133 out of 1217, remaining: 00:33)
test 1700 SKIPPED: curl lacks http/2 server support
test 1701 SKIPPED: curl lacks http/2 server support
test 1702 SKIPPED: curl lacks http/2 server support
test 1800 SKIPPED: curl lacks http/2 support
test 2000...[FTP RETR followed by FILE]
sp----e--- OK (1139 out of 1217, remaining: 00:30)
test 2001...[HTTP GET followed by FTP RETR followed by FILE]
sp----e--- OK (1140 out of 1217, remaining: 00:30)
test 2002...[HTTP GET followed by FTP RETR followed by FILE followed by TFTP RRQ]
sp----e--- OK (1141 out of 1217, remaining: 00:29)
test 2003...[HTTP GET followed by FTP RETR followed by FILE followed by TFTP RRQ then again in reverse order]
sp----e--- OK (1142 out of 1217, remaining: 00:29)
test 2005 SKIPPED: curl lacks Metalink support
test 2006 SKIPPED: curl lacks Metalink support
test 2007 SKIPPED: curl lacks Metalink support
test 2023...[HTTP authorization retry (Basic)]
-pd---e--- OK (1162 out of 1217, remaining: 00:21)
test 2024...[HTTP authorization retry (Basic switching to Digest)]
-pd---e--- OK (1163 out of 1217, remaining: 00:20)
test 2025...[HTTP authorization retry (Basic switching to NTLM)]
-pd---e--- OK (1164 out of 1217, remaining: 00:20)
test 2026...[HTTP authorization retry (Digest switching to Basic)]
-pd---e--- OK (1165 out of 1217, remaining: 00:19)
test 2027...[HTTP authorization retry (Digest)]
-pd---e--- OK (1166 out of 1217, remaining: 00:19)
test 2028...[HTTP authorization retry (Digest switching to NTLM)]
-pd---e--- OK (1167 out of 1217, remaining: 00:19)
test 2029...[HTTP authorization retry (NTLM switching to Basic)]
-pd---e--- OK (1168 out of 1217, remaining: 00:18)
test 2030...[HTTP authorization retry (NTLM switching to Digest)]
-pd---e--- OK (1169 out of 1217, remaining: 00:18)
test 2031...[HTTP authorization retry (NTLM)]
-pd---e--- OK (1170 out of 1217, remaining: 00:18)
test 2032...[NTLM connection mapping]
-pd---e--- OK (1171 out of 1217, remaining: 00:17)
test 2034...[simple HTTPS GET with DER public key pinning]
-pd---e--- OK (1172 out of 1217, remaining: 00:17)
test 2035...[HTTPS wrong DER pinnedpubkey but right CN]
------e--- OK (1173 out of 1217, remaining: 00:17)
test 2036...[HTTP, -O with no slash at all in the URL]
------e--- OK (1174 out of 1217, remaining: 00:16)
test 2037...[simple HTTPS GET with PEM public key pinning]
-pd---e--- OK (1175 out of 1217, remaining: 00:16)
test 2038...[HTTPS wrong PEM pinnedpubkey but right CN]
------e--- OK (1176 out of 1217, remaining: 00:15)
test 2039...[FTP (optional .netrc with 'default' override; no user/pass) dir list PASV]
-pd---e--- OK (1177 out of 1217, remaining: 00:15)
test 2040...[HTTP Basic authorization, then without authorization]
sp----e--- OK (1178 out of 1217, remaining: 00:15)
test 2041...[simple HTTPS GET with base64-sha256 public key pinning]
-pd---e--- OK (1179 out of 1217, remaining: 00:14)
test 2042...[HTTPS wrong base64-sha256 pinnedpubkey but right CN]
------e--- OK (1180 out of 1217, remaining: 00:14)
test 2043 SKIPPED: curl lacks WinSSL support
test 2044...[Attempt to set a default protocol that does not exist]
------e--- OK (1182 out of 1217, remaining: 00:13)
test 2045...[Set the default protocol to ftp for a schemeless URL]
------e--- OK (1183 out of 1217, remaining: 00:13)
test 2048...[pinnedpubkey no-match must fail even when insecure]
------e--- OK (1186 out of 1217, remaining: 00:11)
test 2049...[Connect to specific host]
-pd---e--- OK (1187 out of 1217, remaining: 00:11)
test 2051...[Connect to specific host: Re-use existing connections if possible]
sp----e--- OK (1189 out of 1217, remaining: 00:10)
test 2052...[Connect to specific host: Do not mix connections with and without a "connect to host"]
sp----e--- OK (1190 out of 1217, remaining: 00:10)
test 2053...[Connect to specific host with IP addresses]
-pd---e--- OK (1191 out of 1217, remaining: 00:10)
test 2054...[Connect to specific host: use the first "connect-to" string that matches]
-pd---e--- OK (1192 out of 1217, remaining: 00:09)
test 2056 SKIPPED: curl lacks GSS-API support
test 2057 SKIPPED: curl lacks GSS-API support
test 2061...[HTTP with RFC7616 SHA256 Digest authorization]
-pd---e--- OK (1199 out of 1217, remaining: 00:06)
test 2062...[HTTP with RFC7616 SHA-512-256 Digest authorization and userhash=false]
-pd---e--- OK (1200 out of 1217, remaining: 00:06)
test 2063...[HTTP with RFC7616 SHA-512-256 Digest authorization and userhash=true]
-pd---e--- OK (1201 out of 1217, remaining: 00:06)
test 2064...[HTTP with RFC7616 Digest authorization with bad password and SHA256]
-pd---e--- OK (1202 out of 1217, remaining: 00:05)
test 2065...[HTTP with RFC7616 Digest authorization with bad password, SHA-512-256 and userhash=false]
-pd---e--- OK (1203 out of 1217, remaining: 00:05)
test 2066...[HTTP with RFC7616 Digest authorization with bad password, SHA-512-256 and userhash=true]
-pd---e--- OK (1204 out of 1217, remaining: 00:04)
test 2067...[HTTP POST --digest with SHA256 and user-specified Content-Length header]
-pd---e--- OK (1205 out of 1217, remaining: 00:04)
test 2068...[HTTP POST --digest with SHA-512-256, userhash=false and user-specified Content-Length header]
-pd---e--- OK (1206 out of 1217, remaining: 00:04)
test 2069...[HTTP POST --digest with SHA-512-256, userhash=true and user-specified Content-Length header]
-pd---e--- OK (1207 out of 1217, remaining: 00:03)
test 2071...[basic file:// file with "127.0.0.1" hostname]
--d---e--- OK (1208 out of 1217, remaining: 00:03)
test 2072...[file:// with unix path resolution behavior for the case of extra slashes]
--d---e--- OK (1209 out of 1217, remaining: 00:03)
test 2073...[HTTP form posts with handle reset]
-pd---e--- OK (1210 out of 1217, remaining: 00:02)
test 2074...[HTTP GET]
-pd---e--- OK (1211 out of 1217, remaining: 00:02)
test 2075...[Verify usernames are not allowed in url]
------e--- OK (1212 out of 1217, remaining: 00:01)
test 2076...[HTTP with digest auth and URI contains query]
-pd---e--- OK (1213 out of 1217, remaining: 00:01)
test 2080...[config file with overly long option]
------e--- OK (1214 out of 1217, remaining: 00:01)
test 2100 SKIPPED: curl lacks http/2 support
test 3000...[HTTPS GET to localhost, first subject alt name matches, CN does not match]
-pd---e--- OK (1216 out of 1217, remaining: 00:00)
test 3001...[HTTPS GET to localhost, last subject alt name matches, CN does not match]
-pd---e--- OK (1217 out of 1217, remaining: 00:00)
Warning: smb server unexpectedly alive
Warning: dict server unexpectedly alive
TESTDONE: 976 tests out of 977 reported OK: 99%
TESTFAIL: These test cases failed: 330
TESTDONE: 1236 tests were considered during 479 seconds.
TESTINFO: 259 tests were skipped due to these restraints:
TESTINFO: "curl lacks WinSSL support" 1 times (2043)
TESTINFO: "curl lacks PSL support" 1 times (1136)
TESTINFO: "configured as DISABLED" 19 times (530, 536, 584, 594, 836, 882, 938, 1209, 1211 and 10 more)
TESTINFO: "curl lacks brotli support" 3 times (314, 315, 316)
TESTINFO: "failed starting SSH server" 47 times (582, 583, 600, 601, 602, 603, 604, 605, 606 and 38 more)
TESTINFO: "rlimit problem: fds needed 1050 > system limit 1040" 1 times (518)
TESTINFO: "curl lacks GSS-API support" 3 times (1282, 2056, 2057)
TESTINFO: "curl has threaded-resolver support" 1 times (506)
TESTINFO: "disabled by keyword" 147 times (5, 16, 43, 63, 79, 80, 81, 82, 83 and 138 more)
TESTINFO: "curl lacks Metalink support" 18 times (2005, 2006, 2007, 2008, 2009, 2010, 2011, 2012, 2013 and 9 more)
TESTINFO: "curl lacks ldap support" 1 times (1560)
TESTINFO: "curl lacks http/2 server support" 3 times (1700, 1701, 1702)
TESTINFO: "curl has ipv6 support" 1 times (1454)
TESTINFO: "curl lacks TrackMemory support" 3 times (96, 558, 1330)
TESTINFO: "curl lacks idn support" 6 times (165, 1034, 1035, 1448, 2046, 2047)
TESTINFO: "openssl engine not supported" 1 times (307)
TESTINFO: "curl lacks http/2 support" 3 times (1650, 1800, 2100)
Makefile:801: recipe for target 'full-test' failed
gmake[1]: *** [full-test] Error 1
gmake[1]: Leaving directory '/build-2737/tests'
Makefile:1378: recipe for target 'test-full' failed
gmake: *** [test-full] Error 2
testcurl: tests were run
testcurl: the tests were not successful
testcurl: ending nicely
testcurl: removing the build-2737 dir
testcurl: removing the buildlog-2737 file

Download build log