curl / Autobuilds / Log From 2019-08-10

Log from 2019-08-10

Jump down to problem:1 2 3 4 5 6 7 8 9 10 11 12 13 14 15 16 17 18 19 20 test results

testcurl:[20]TRANSFER[20]CONTROL[20]====[20]1120[20]CHAR[20]LINEoooooooooooooooooooooooooooooooooooooooooooooooooooooooooooooooooooooooooooooooooooooooooooooooooooooooooooooooooooooooooooooooooooooooooooooooooooooooooooooooooooooooooooooooooooooooooooooooooooooooooooooooooooooooooooooooooooooooooooooooooooooooooooooooooooooooooooooooooooooooooooooooooooooooooooooooooooooooooooooooooooooooooooooooooooooooooooooooooooooooooooooooooooooooooooooooooooooooooooooooooooooooooooooooooooooooooooooooooooooooooooooooooooooooooooooooooooooooooooooooooooooooooooooooooooooooooooooooooooooooooooooooooooooooooooooooooooooooooooooooooooooooooooooooooooooooooooooooooooooooooooooooooooooooooooooooooooooooooooooooooooooooooooooooooooooooooooooooooooooooooooooooooooooooooooooooooooooooooooooooooooooooooooooooooooooooooooooooooooooooooooooooooooooooooooooooooooooooooooooooooooooooooooooooooooooooooooooooooooooooooooooooooooooooooooooooooooooooooooooooooooooooooooooooooooooooooooooooooooooooooooooooooooooooooooooooooooooooo
ooooooooooooooooooooooooooooooooooooooooooooooooooooooooooooooooooooooooooooooooooooooooooooooooooooooooooooooooooLINE_END
testcurl: NAME = Marc
testcurl: EMAIL = info/at/marc-hoersken/dot/de
testcurl: DESC = Win32 target on Windows Server 2016 Datacenter, version 1803 (64-bit) - i686-w64-mingw32 - gcc-9.1.0 (Msys2)
testcurl: NOTES =
testcurl: CONFOPTS = --build=i686-w64-mingw32 --host=i686-w64-mingw32 --with-winssl --with-winidn --with-libssh2=/tmp/curl_winssl_msys2_mingw32_dbg/libssh2 --enable-sspi --enable-ipv6 --enable-debug --enable-warnings
testcurl: RUNTESTOPTS = -d -a -p -r
testcurl: CPPFLAGS =
testcurl: CFLAGS =
testcurl: LDFLAGS =
testcurl: LIBS =
testcurl: CC =
testcurl: TMPDIR =
testcurl: MAKEFLAGS =
testcurl: ACLOCAL_FLAGS =
testcurl: PKG_CONFIG_PATH = /mingw32/lib/pkgconfig:/mingw32/share/pkgconfig
testcurl: DYLD_LIBRARY_PATH =
testcurl: LD_LIBRARY_PATH =
testcurl: LIBRARY_PATH =
testcurl: SHLIB_PATH =
testcurl: LIBPATH =
testcurl: target = mingw
testcurl: version = 2014-11-25
testcurl: date = Sat Aug 10 06:23:46 2019 UTC
testcurl: ./ is verified to be a fine git source dir
testcurl: build dir build-1440 was created fine
testcurl: skipping git pull (--nogitpull)
testcurl: The most recent curl git commits:
testcurl: 084404b8a CURLOPT_H3: removed
testcurl: db061571e http3: make connection reuse work
testcurl: 4570c22c5 quiche: add SSLKEYLOGFILE support
testcurl: 6ee9e4bd4 cleanup: s/curl_debug/curl_dbg_debug in comments and docs
testcurl: c5ee65ffa RELEASE-NOTES: synced
testcurl: invoke buildconf
buildconf: autoconf version 2.69 (ok)
buildconf: autom4te version 2.69 (ok)
buildconf: autoheader version 2.69 (ok)
buildconf: automake version 1.16.1 (ok)
buildconf: aclocal version 1.16.1 (ok)
buildconf: libtoolize version 2.4.6 (ok)
buildconf: GNU m4 version 1.4.18 (ok)
buildconf: running libtoolize
libtoolize: putting auxiliary files in '.'.
libtoolize: copying file './ltmain.sh'
libtoolize: putting macros in AC_CONFIG_MACRO_DIRS, 'm4'.
libtoolize: copying file 'm4/libtool.m4'
libtoolize: copying file 'm4/ltoptions.m4'
libtoolize: copying file 'm4/ltsugar.m4'
libtoolize: copying file 'm4/ltversion.m4'
libtoolize: copying file 'm4/lt~obsolete.m4'
libtoolize: Remember to add 'LT_INIT' to configure.ac.
buildconf: converting all mv to mv -f in local m4/libtool.m4
buildconf: running aclocal
buildconf: converting all mv to mv -f in local aclocal.m4
buildconf: running autoheader
buildconf: running autoconf
buildconf: running automake
configure.ac:132: installing './compile'
configure.ac:191: installing './config.guess'
configure.ac:191: installing './config.sub'
configure.ac:132: installing './install-sh'
configure.ac:137: installing './missing'
docs/examples/Makefile.am: installing './depcomp'
parallel-tests: installing './test-driver'
buildconf: OK
testcurl: buildconf was successful
testcurl: timestamp = [unreleased] UTC
testcurl: configure created (at least it exists)
testcurl: going with make as make
configure: loading site script /mingw32/etc/config.site
checking whether to enable maintainer-specific portions of Makefiles... no
checking whether make supports nested variables... yes
checking whether to enable debug build options... yes
checking whether to enable compiler optimizer... (assumed) no
checking whether to enable strict compiler warnings... yes
checking whether to enable compiler warnings as errors... no
checking whether to enable curl debug memory tracking... (assumed) yes
checking whether to enable hiding of library internal symbols... yes
checking whether to enable c-ares for DNS lookups... no
checking whether to disable dependency on -lrt... (assumed no)
checking for path separator... :
checking for sed... /usr/bin/sed
checking for grep... /usr/bin/grep
checking for egrep... /usr/bin/grep -E
checking for i686-w64-mingw32-ar... no
checking for ar... /mingw32/bin/ar
checking for a BSD-compatible install... /usr/bin/install -c
checking for i686-w64-mingw32-gcc... i686-w64-mingw32-gcc
checking whether the C compiler works... yes
checking for C compiler default output file name... a.exe
checking for suffix of executables... .exe
checking whether we are cross compiling... no
checking for suffix of object files... o
checking whether we are using the GNU C compiler... yes
checking whether i686-w64-mingw32-gcc accepts -g... yes
checking for i686-w64-mingw32-gcc option to accept ISO C89... none needed
checking whether i686-w64-mingw32-gcc understands -c and -o together... yes
checking how to run the C preprocessor... i686-w64-mingw32-gcc -E
checking for a sed that does not truncate output... (cached) /usr/bin/sed
checking for code coverage support... no
checking whether build environment is sane... yes
checking for a thread-safe mkdir -p... /usr/bin/mkdir -p
checking for gawk... gawk
checking whether make sets $(MAKE)... yes
checking whether make supports the include directive... yes (GNU style)
checking dependency style of i686-w64-mingw32-gcc... gcc3
checking curl version... 7.66.0-DEV
checking build system type... i686-w64-mingw32
checking host system type... i686-w64-mingw32
checking for grep that handles long lines and -e... (cached) /usr/bin/grep
checking for egrep... /usr/bin/grep -E
checking if OS is AIX (to define _ALL_SOURCE)... no
checking if _THREAD_SAFE is already defined... no
checking if _THREAD_SAFE is actually needed... no
checking if _THREAD_SAFE is onwards defined... no
checking if _REENTRANT is already defined... yes
checking if _REENTRANT is onwards defined... yes
checking for special C compiler options needed for large files... no
checking for _FILE_OFFSET_BITS value needed for large files... 64
checking how to print strings... printf
checking for a sed that does not truncate output... (cached) /usr/bin/sed
checking for fgrep... /usr/bin/grep -F
checking for ld used by i686-w64-mingw32-gcc... C:/msys64/mingw32/i686-w64-mingw32/bin/ld.exe
checking if the linker (C:/msys64/mingw32/i686-w64-mingw32/bin/ld.exe) is GNU ld... yes
checking for BSD- or MS-compatible name lister (nm)... /mingw32/bin/nm -B
checking the name lister (/mingw32/bin/nm -B) interface... BSD nm
checking whether ln -s works... no, using cp -pR
checking the maximum length of command line arguments... 8192
checking how to convert i686-w64-mingw32 file names to i686-w64-mingw32 format... func_convert_file_msys_to_w32
checking how to convert i686-w64-mingw32 file names to toolchain format... func_convert_file_msys_to_w32
checking for C:/msys64/mingw32/i686-w64-mingw32/bin/ld.exe option to reload object files... -r
checking for i686-w64-mingw32-objdump... no
checking for objdump... objdump
checking how to recognize dependent libraries... file_magic ^x86 archive import|^x86 DLL
checking for i686-w64-mingw32-dlltool... no
checking for dlltool... dlltool
checking how to associate runtime and link libraries... func_cygming_dll_for_implib
checking for i686-w64-mingw32-ar... /mingw32/bin/ar
checking for archiver @FILE support... @
checking for i686-w64-mingw32-strip... no
checking for strip... strip
checking for i686-w64-mingw32-ranlib... no
checking for ranlib... ranlib
checking command to parse /mingw32/bin/nm -B output from i686-w64-mingw32-gcc object... ok
checking for sysroot... no
checking for a working dd... /usr/bin/dd
checking how to truncate binary pipes... /usr/bin/dd bs=4096 count=1
checking for i686-w64-mingw32-mt... no
checking for mt... no
checking if : is a manifest tool... no
checking for ANSI C header files... yes
checking for sys/types.h... yes
checking for sys/stat.h... yes
checking for stdlib.h... yes
checking for string.h... yes
checking for memory.h... yes
checking for strings.h... yes
checking for inttypes.h... yes
checking for stdint.h... yes
checking for unistd.h... yes
checking for dlfcn.h... no
checking for i686-w64-mingw32-as... no
checking for as... as
checking for i686-w64-mingw32-dlltool... dlltool
checking for i686-w64-mingw32-objdump... objdump
checking for objdir... .libs
checking if i686-w64-mingw32-gcc supports -fno-rtti -fno-exceptions... no
checking for i686-w64-mingw32-gcc option to produce PIC... -DDLL_EXPORT -DPIC
checking if i686-w64-mingw32-gcc PIC flag -DDLL_EXPORT -DPIC works... yes
checking if i686-w64-mingw32-gcc static flag -static works... yes
checking if i686-w64-mingw32-gcc supports -c -o file.o... yes
checking if i686-w64-mingw32-gcc supports -c -o file.o... (cached) yes
checking whether the i686-w64-mingw32-gcc linker (C:/msys64/mingw32/i686-w64-mingw32/bin/ld.exe) supports shared libraries... yes
checking whether -lc should be explicitly linked in... yes
checking dynamic linker characteristics... Win32 ld.exe
checking how to hardcode library paths into programs... immediate
checking whether stripping libraries is possible... yes
checking if libtool supports shared libraries... yes
checking whether to build shared libraries... yes
checking whether to build static libraries... yes
checking whether to build shared libraries with -version-info... yes
checking whether to build shared libraries with -no-undefined... yes
checking whether to build shared libraries with -mimpure-text... no
checking whether to build shared libraries with PIC... yes
checking whether to build static libraries with PIC... no
checking whether to build shared libraries only... no
checking whether to build static libraries only... no
checking for inline... inline
checking if cpp -P is needed... yes
checking if cpp -P works... yes
checking if compiler is DEC/Compaq/HP C... no
checking if compiler is HP-UX C... no
checking if compiler is IBM C... no
checking if compiler is Intel C... no
checking if compiler is clang... no
checking if compiler is GNU C... yes
checking if compiler is LCC... no
checking if compiler is SGI MIPSpro C... no
checking if compiler is SGI MIPS C... no
checking if compiler is SunPro C... no
checking if compiler is Tiny C... no
checking if compiler is Watcom C... no
checking if compiler accepts some basic options... yes
configure: compiler options added: -Werror-implicit-function-declaration
checking if compiler accepts debug enabling options... yes
configure: compiler options added: -g
checking if compiler optimizer assumed setting might be used... yes
checking if compiler accepts optimizer disabling options... yes
configure: compiler options added: -O0
checking if compiler accepts strict warning options... yes
configure: compiler options added: -pedantic -Wall -W -Wpointer-arith -Wwrite-strings -Wunused -Wshadow -Winline -Wnested-externs -Wmissing-declarations -Wmissing-prototypes -Wno-long-long -Wbad-function-cast -Wfloat-equal -Wno-multichar -Wsign-compare -Wundef -Wno-format-nonliteral -Wendif-labels -Wstrict-prototypes -Wdeclaration-after-statement -Wold-style-definition -Wstrict-aliasing=3 -Wcast-align -Wtype-limits -Wold-style-declaration -Wmissing-parameter-type -Wempty-body -Wclobbered -Wignored-qualifiers -Wconversion -Wno-sign-conversion -Wvla -ftree-vrp -Wno-pedantic-ms-format -Wdouble-promotion -Wformat=2 -Warray-bounds=2 -Wshift-negative-value -Wshift-overflow=2 -Wnull-dereference -fdelete-null-pointer-checks -Wduplicated-cond -Wunused-const-variable -Wduplicated-branches -Wrestrict -Walloc-zero -Wformat-overflow=2 -Wformat-truncation=2 -Wimplicit-fallthrough=4 -Wno-system-headers
checking if compiler halts on compilation errors... yes
checking if compiler halts on negative sized arrays... yes
checking if compiler halts on function prototype mismatch... yes
checking if compiler supports hiding library internal symbols... yes
configure: WARNING: shared library does not support undefined symbols.
checking if curl debug memory tracking can be enabled... no
configure: WARNING: cannot enable curl debug memory tracking.
checking for windows.h... yes
checking whether build target is a native Windows one... yes
checking for winsock.h... yes
checking for winsock2.h... yes
checking for ws2tcpip.h... yes
checking for winldap.h... yes
checking for winber.h... yes
checking whether build target supports WIN32 file API... yes (large file enabled)
checking for good-to-use Mac CFLAGS... no
checking to see if the compiler supports __builtin_available()... no
checking whether to support http... yes
checking whether to support ftp... yes
checking whether to support file... yes
checking whether to support ldap... yes
checking whether to support ldaps... yes
checking whether to support rtsp... yes
checking whether to support proxies... yes
checking whether to support dict... yes
checking whether to support telnet... yes
checking whether to support tftp... yes
checking whether to support pop3... yes
checking whether to support imap... yes
checking whether to support smb... yes
checking whether to support smtp... yes
checking whether to support gopher... yes
checking whether to provide built-in manual... yes
checking whether to enable generation of C code... yes
checking whether to use libgcc... no
checking if X/Open network library is required... no
checking for gethostbyname... no
checking for gethostbyname in -lnsl... no
checking for gethostbyname in -lsocket... no
checking for gethostbyname in -lwatt... no
checking for gethostbyname with both nsl and socket libs... no
checking for gethostbyname in -lws2_32... yes
checking for windows.h... (cached) yes
checking for winsock.h... (cached) yes
checking for winsock2.h... (cached) yes
checking for proto/bsdsocket.h... no
checking for connect in libraries... yes
checking whether time.h and sys/time.h may both be included... yes
checking for sys/types.h... (cached) yes
checking sys/time.h usability... yes
checking sys/time.h presence... yes
checking for sys/time.h... yes
checking time.h usability... yes
checking time.h presence... yes
checking for time.h... yes
checking for monotonic clock_gettime... yes
checking for clock_gettime in libraries... no additional lib required
checking if monotonic clock_gettime works... yes
checking for i686-w64-mingw32-pkg-config... /mingw32/bin/i686-w64-mingw32-pkg-config
checking for zlib options with pkg-config... found
checking zlib.h usability... yes
checking zlib.h presence... yes
checking for zlib.h... yes
configure: found both libz and libz.h header
checking for BrotliDecoderDecompress in -lbrotlidec... no
checking brotli/decode.h usability... no
checking brotli/decode.h presence... no
checking for brotli/decode.h... no
checking for lber.h... no
checking for ldap.h... no
checking for ldapssl.h... no
checking for ldap_ssl.h... no
checking for ldap_init in -l"wldap32"... yes
checking for ldap_url_parse... no
checking for ldap_init_fd... no
checking whether to enable IPv6... yes
checking if struct sockaddr_in6 has sin6_scope_id member... yes
checking if argv can be written to... no
checking if GSS-API support is requested... no
checking whether to enable Windows native SSL/TLS (Windows native builds only)... yes
checking whether to enable Secure Transport... no
checking whether to enable Amiga native SSL/TLS (AmiSSL)... no
checking for gdi32... yes
checking for i686-w64-mingw32-pkg-config... (cached) /mingw32/bin/i686-w64-mingw32-pkg-config
checking for openssl options with pkg-config... found
configure: pkg-config: SSL_LIBS: "-lssl -lcrypto"
configure: pkg-config: SSL_LDFLAGS: "-LC:/msys64/mingw32/lib"
configure: pkg-config: SSL_CPPFLAGS: "-IC:/msys64/mingw32/include"
checking for HMAC_Update in -lcrypto... yes
checking for SSL_connect in -lssl... yes
checking openssl/x509.h usability... yes
checking openssl/x509.h presence... yes
checking for openssl/x509.h... yes
checking openssl/rsa.h usability... yes
checking openssl/rsa.h presence... yes
checking for openssl/rsa.h... yes
checking openssl/crypto.h usability... yes
checking openssl/crypto.h presence... yes
checking for openssl/crypto.h... yes
checking openssl/pem.h usability... yes
checking openssl/pem.h presence... yes
checking for openssl/pem.h... yes
checking openssl/ssl.h usability... yes
checking openssl/ssl.h presence... yes
checking for openssl/ssl.h... yes
checking openssl/err.h usability... yes
checking openssl/err.h presence... yes
checking for openssl/err.h... yes
checking for RAND_egd... no
checking for SSLv2_client_method... no
checking for OpenSSL_version... yes
checking for BoringSSL... no
checking for libressl... no
configure: Added C:/msys64/mingw32/lib to CURL_LIBRARY_PATH
checking for OpenSSL headers version... 1.1.1 - 0x1010103fL
checking for OpenSSL library version... 1.1.1
checking for OpenSSL headers and library versions matching... yes
checking for "/dev/urandom"... yes
checking for SRP_Calc_client_key in -lcrypto... yes
configure: built with multiple SSL backends
checking default CA cert bundle/path... no
checking whether to use builtin CA store of SSL library... no
checking for library containing psl_builtin... no
configure: WARNING: libpsl was not found
checking for libssh2_channel_open_ex in -lssh2... yes
checking libssh2.h usability... yes
checking libssh2.h presence... yes
checking for libssh2.h... yes
configure: Added /tmp/curl_winssl_msys2_mingw32_dbg/libssh2/lib to CURL_LIBRARY_PATH
checking for RTMP_Init in -lrtmp... no
checking whether versioned symbols are wanted... no
checking whether to enable Windows native IDN (Windows native builds only)... yes
checking if IdnToUnicode can be linked... yes
checking whether to build with libidn2... (assumed) yes
checking for i686-w64-mingw32-pkg-config... (cached) /mingw32/bin/i686-w64-mingw32-pkg-config
checking for libidn2 options with pkg-config... no
configure: IDN_LIBS: "-lidn2"
configure: IDN_LDFLAGS: ""
configure: IDN_CPPFLAGS: ""
configure: IDN_DIR: ""
checking if idn2_lookup_ul can be linked... no
checking idn2.h usability... no
checking idn2.h presence... no
checking for idn2.h... no
configure: WARNING: Cannot find libraries for IDN support: IDN disabled
checking for i686-w64-mingw32-pkg-config... (cached) /mingw32/bin/i686-w64-mingw32-pkg-config
checking for libnghttp2 options with pkg-config... no
checking for i686-w64-mingw32-pkg-config... (cached) /mingw32/bin/i686-w64-mingw32-pkg-config
checking for libngtcp2 options with pkg-config... no
checking for quiche_connect in -lquiche... no
checking for i686-w64-mingw32-pkg-config... (cached) /mingw32/bin/i686-w64-mingw32-pkg-config
checking for fish options with pkg-config... no
checking for ANSI C header files... (cached) yes
checking for malloc.h... yes
checking for memory.h... no
checking for sys/types.h... (cached) yes
checking for sys/time.h... (cached) yes
checking for sys/select.h... no
checking for sys/socket.h... no
checking for sys/ioctl.h... no
checking for sys/uio.h... no
checking for assert.h... yes
checking for unistd.h... (cached) yes
checking for stdlib.h... (cached) yes
checking for arpa/inet.h... no
checking for net/if.h... no
checking for netinet/in.h... no
checking for netinet/in6.h... no
checking for sys/un.h... no
checking for linux/tcp.h... no
checking for netinet/tcp.h... no
checking for netdb.h... no
checking for sys/sockio.h... no
checking for sys/stat.h... (cached) yes
checking for sys/param.h... yes
checking for termios.h... no
checking for termio.h... no
checking for sgtty.h... no
checking for fcntl.h... yes
checking for alloca.h... no
checking for time.h... (cached) yes
checking for io.h... yes
checking for pwd.h... no
checking for utime.h... yes
checking for sys/utime.h... yes
checking for sys/poll.h... no
checking for poll.h... no
checking for socket.h... no
checking for sys/resource.h... no
checking for libgen.h... yes
checking for locale.h... yes
checking for errno.h... yes
checking for stdbool.h... yes
checking for arpa/tftp.h... no
checking for sys/filio.h... no
checking for sys/wait.h... no
checking for setjmp.h... yes
checking for an ANSI C-conforming const... yes
checking for compiler support of C99 variadic macro style... yes
checking for compiler support of old gcc variadic macro style... yes
checking for size_t... yes
checking whether time.h and sys/time.h may both be included... (cached) yes
checking for sys/types.h... (cached) yes
checking for sys/time.h... (cached) yes
checking for time.h... (cached) yes
checking for sys/socket.h... (cached) no
checking for struct timeval... yes
checking run-time libs availability... fine
checking size of size_t... 4
checking size of long... 4
checking size of int... 4
checking size of short... 2
checking size of time_t... 4
checking size of off_t... 8
checking size of curl_off_t... 8
checking for long long... yes
checking if numberLL works... yes
checking for ssize_t... yes
checking for bool... yes
checking for sa_family_t... no
checking for ADDRESS_FAMILY... no
checking if time_t is unsigned... no
checking for sys/types.h... (cached) yes
checking for poll.h... (cached) no
checking for sys/poll.h... (cached) no
checking for in_addr_t... no
checking for in_addr_t equivalent... unsigned long
checking for struct sockaddr_storage... yes
checking signal.h usability... yes
checking signal.h presence... yes
checking for signal.h... yes
checking for sig_atomic_t... yes
checking if sig_atomic_t is already defined as volatile... no
checking return type of signal handlers... void
checking for sys/select.h... (cached) no
checking for sys/socket.h... (cached) no
checking for select... yes
checking types of args and return type for select... int,fd_set *,struct timeval *,int
checking for sys/types.h... (cached) yes
checking for sys/socket.h... (cached) no
checking for recv... yes
checking types of args and return type for recv... SOCKET,char *,int,int,int
checking for sys/types.h... (cached) yes
checking for sys/socket.h... (cached) no
checking for send... yes
checking types of args and return type for send... SOCKET,const char *,int,int,int
checking for sys/types.h... (cached) yes
checking for sys/socket.h... (cached) no
checking for MSG_NOSIGNAL... no
checking for sys/types.h... (cached) yes
checking for unistd.h... (cached) yes
checking if alarm can be linked... yes
checking if alarm is prototyped... no
checking if alarm might be used... no
checking for sys/types.h... (cached) yes
checking for string.h... (cached) yes
checking for strings.h... (cached) yes
checking for sys/types.h... (cached) yes
checking for libgen.h... (cached) yes
checking if basename can be linked... yes
checking if basename is prototyped... yes
checking if basename is compilable... yes
checking if basename usage allowed... yes
checking if basename might be used... yes
checking for sys/types.h... (cached) yes
checking for socket.h... (cached) no
checking if closesocket can be linked... yes
checking if closesocket is prototyped... yes
checking if closesocket is compilable... yes
checking if closesocket usage allowed... yes
checking if closesocket might be used... yes
checking for sys/types.h... (cached) yes
checking for sys/socket.h... (cached) no
checking if CloseSocket can be linked... no
checking if CloseSocket might be used... no
checking if connect can be linked... yes
checking if connect is prototyped... yes
checking if connect is compilable... yes
checking if connect usage allowed... yes
checking if connect might be used... yes
checking for sys/types.h... (cached) yes
checking for unistd.h... (cached) yes
checking for fcntl.h... (cached) yes
checking if fcntl can be linked... no
checking if fcntl might be used... no
checking for windows.h... (cached) yes
checking for winsock2.h... (cached) yes
checking for ws2tcpip.h... (cached) yes
checking for sys/types.h... (cached) yes
checking for netdb.h... (cached) no
checking if freeaddrinfo can be linked... yes
checking if freeaddrinfo is prototyped... yes
checking if freeaddrinfo is compilable... yes
checking if freeaddrinfo usage allowed... yes
checking if freeaddrinfo might be used... yes
checking for sys/types.h... (cached) yes
checking for sys/socket.h... (cached) no
checking for netinet/in.h... (cached) no
checking for ifaddrs.h... no
checking if freeifaddrs can be linked... no
checking if freeifaddrs might be used... no
checking for sys/types.h... (cached) yes
checking for sys/xattr.h... no
checking if fsetxattr can be linked... no
checking if fsetxattr might be used... no
checking if ftruncate can be linked... yes
checking if ftruncate is prototyped... yes
checking if ftruncate is compilable... yes
checking if ftruncate usage allowed... yes
checking if ftruncate might be used... yes
checking for sys/types.h... (cached) yes
checking for stdlib.h... (cached) yes
checking if getaddrinfo can be linked... yes
checking if getaddrinfo is prototyped... yes
checking if getaddrinfo is compilable... yes
checking if getaddrinfo seems to work... yes
checking if getaddrinfo usage allowed... yes
checking if getaddrinfo might be used... yes
checking if getaddrinfo is threadsafe... yes
checking if gai_strerror can be linked... no
checking if gai_strerror might be used... no
checking if gethostbyaddr can be linked... yes
checking if gethostbyaddr is prototyped... yes
checking if gethostbyaddr is compilable... yes
checking if gethostbyaddr usage allowed... yes
checking if gethostbyaddr might be used... yes
checking if gethostbyaddr_r can be linked... no
checking if gethostbyaddr_r might be used... no
checking if gethostbyname can be linked... yes
checking if gethostbyname is prototyped... yes
checking if gethostbyname is compilable... yes
checking if gethostbyname usage allowed... yes
checking if gethostbyname might be used... yes
checking if gethostbyname_r can be linked... no
checking if gethostbyname_r might be used... no
checking if gethostname can be linked... yes
checking if gethostname is prototyped... yes
checking if gethostname is compilable... yes
checking for gethostname arg 2 data type... int
checking if gethostname usage allowed... yes
checking if gethostname might be used... yes
checking if getpeername can be linked... yes
checking if getpeername is prototyped... yes
checking if getpeername is compilable... yes
checking if getpeername usage allowed... yes
checking if getpeername might be used... yes
checking if getsockname can be linked... yes
checking if getsockname is prototyped... yes
checking if getsockname is compilable... yes
checking if getsockname usage allowed... yes
checking if getsockname might be used... yes
checking for net/if.h... (cached) no
checking if if_nametoindex can be linked... no
checking if if_nametoindex might be used... no
checking if getifaddrs can be linked... no
checking if getifaddrs might be used... no
checking if getservbyport_r can be linked... no
checking if getservbyport_r might be used... no
checking for sys/types.h... (cached) yes
checking for sys/time.h... (cached) yes
checking for time.h... (cached) yes
checking if gmtime_r can be linked... no
checking if gmtime_r might be used... no
checking for sys/types.h... (cached) yes
checking for sys/socket.h... (cached) no
checking for netinet/in.h... (cached) no
checking for arpa/inet.h... (cached) no
checking if inet_ntoa_r can be linked... no
checking if inet_ntoa_r might be used... no
checking if inet_ntop can be linked... no
checking if inet_ntop might be used... no
checking if inet_pton can be linked... no
checking if inet_pton might be used... no
checking for sys/types.h... (cached) yes
checking for unistd.h... (cached) yes
checking for sys/socket.h... (cached) no
checking for sys/ioctl.h... (cached) no
checking for stropts.h... no
checking if ioctl can be linked... no
checking if ioctl might be used... no
checking if ioctlsocket can be linked... yes
checking if ioctlsocket is prototyped... yes
checking if ioctlsocket is compilable... yes
checking if ioctlsocket usage allowed... yes
checking if ioctlsocket might be used... yes
checking if ioctlsocket FIONBIO is compilable... yes
checking if ioctlsocket FIONBIO usage allowed... yes
checking if ioctlsocket FIONBIO might be used... yes
checking if IoctlSocket can be linked... no
checking if IoctlSocket might be used... no
checking if localtime_r can be linked... no
checking if localtime_r might be used... no
checking if memrchr can be linked... no
checking if memrchr seems a macro... no
checking if memrchr might be used... no
checking if poll can be linked... no
checking if poll might be used... no
checking if setsockopt can be linked... yes
checking if setsockopt is prototyped... yes
checking if setsockopt is compilable... yes
checking if setsockopt usage allowed... yes
checking if setsockopt might be used... yes
checking if setsockopt SO_NONBLOCK is compilable... no
checking if setsockopt SO_NONBLOCK might be used... no
checking for sys/types.h... (cached) yes
checking for signal.h... (cached) yes
checking if sigaction can be linked... no
checking if sigaction might be used... no
checking if siginterrupt can be linked... no
checking if siginterrupt might be used... no
checking if signal can be linked... yes
checking if signal is prototyped... yes
checking if signal is compilable... yes
checking if signal usage allowed... yes
checking if signal might be used... yes
checking for sys/types.h... (cached) yes
checking for setjmp.h... (cached) yes
checking if sigsetjmp can be linked... no
checking if sigsetjmp seems a macro... no
checking if sigsetjmp might be used... no
checking if socket can be linked... yes
checking if socket is prototyped... yes
checking if socket is compilable... yes
checking if socket usage allowed... yes
checking if socket might be used... yes
checking if socketpair can be linked... no
checking if socketpair might be used... no
checking if strcasecmp can be linked... yes
checking if strcasecmp is prototyped... yes
checking if strcasecmp is compilable... yes
checking if strcasecmp usage allowed... yes
checking if strcasecmp might be used... yes
checking if strcmpi can be linked... yes
checking if strcmpi is prototyped... yes
checking if strcmpi is compilable... yes
checking if strcmpi usage allowed... yes
checking if strcmpi might be used... yes
checking if strdup can be linked... yes
checking if strdup is prototyped... yes
checking if strdup is compilable... yes
checking if strdup usage allowed... yes
checking if strdup might be used... yes
checking if strerror_r can be linked... no
checking if strerror_r might be used... no
checking if stricmp can be linked... yes
checking if stricmp is prototyped... yes
checking if stricmp is compilable... yes
checking if stricmp usage allowed... yes
checking if stricmp might be used... yes
checking if strncasecmp can be linked... yes
checking if strncasecmp is prototyped... yes
checking if strncasecmp is compilable... yes
checking if strncasecmp usage allowed... yes
checking if strncasecmp might be used... yes
checking if strncmpi can be linked... no
checking if strncmpi might be used... no
checking if strnicmp can be linked... yes
checking if strnicmp is prototyped... yes
checking if strnicmp is compilable... no
checking if strnicmp might be used... no
checking if strstr can be linked... yes
checking if strstr is prototyped... yes
checking if strstr is compilable... yes
checking if strstr usage allowed... yes
checking if strstr might be used... yes
checking if strtok_r can be linked... yes
checking if strtok_r is prototyped... yes
checking if strtok_r is compilable... yes
checking if strtok_r usage allowed... yes
checking if strtok_r might be used... yes
checking if strtoll can be linked... yes
checking if strtoll is prototyped... yes
checking if strtoll is compilable... yes
checking if strtoll usage allowed... yes
checking if strtoll might be used... yes
checking for sys/types.h... (cached) yes
checking for sys/uio.h... (cached) no
checking if writev can be linked... no
checking if writev might be used... no
checking whether getpwuid_r is declared... no
checking for fnmatch... no
checking deeper for fnmatch... but still no
checking for geteuid... no
checking deeper for geteuid... but still no
checking for getpass_r... no
checking deeper for getpass_r... but still no
checking for getppid... no
checking deeper for getppid... but still no
checking for getpwuid... no
checking deeper for getpwuid... but still no
checking for getpwuid_r... no
checking deeper for getpwuid_r... but still no
checking for getrlimit... no
checking deeper for getrlimit... but still no
checking for gettimeofday... yes
checking for if_nametoindex... no
checking deeper for if_nametoindex... but still no
checking for mach_absolute_time... no
checking deeper for mach_absolute_time... but still no
checking for pipe... no
checking deeper for pipe... but still no
checking for setlocale... yes
checking for setmode... yes
checking for setrlimit... no
checking deeper for setrlimit... but still no
checking for usleep... yes
checking for utime... yes
checking for utimes... no
checking deeper for utimes... but still no
checking how to set a socket into non-blocking mode... ioctlsocket FIONBIO
checking for perl... /usr/bin/perl
checking for gnroff... no
checking for nroff... no
configure: WARNING: disabling built-in manual
checking whether to enable the threaded resolver... yes
checking whether to use POSIX threads for threaded resolver... auto
checking pthread.h usability... yes
checking pthread.h presence... yes
checking for pthread.h... yes
checking for pthread_create... yes
checking whether to enable verbose strings... yes
checking whether to enable SSPI support (Windows native builds only)... yes
checking whether to enable cryptographic authentication methods... yes
checking whether to enable NTLM delegation to winbind's helper... no
checking whether to enable TLS-SRP authentication... yes
checking whether to enable Unix domain sockets... auto
checking for struct sockaddr_un.sun_path... no
checking whether to support cookies... yes
checking whether to support HTTP authentication... yes
checking whether to support DoH... yes
checking whether to support the MIME API... yes
checking whether to support date parsing... yes
checking whether to support netrc parsing... yes
checking whether to support progress-meter... yes
checking whether to support DNS shuffling... yes
checking whether to support alt-svc... no
checking whether hiding of library internal symbols will actually happen... no
checking that generated files are newer than configure... done
configure: creating ./config.status
config.status: creating Makefile
config.status: creating docs/Makefile
config.status: creating docs/examples/Makefile
config.status: creating docs/libcurl/Makefile
config.status: creating docs/libcurl/opts/Makefile
config.status: creating docs/cmdline-opts/Makefile
config.status: creating include/Makefile
config.status: creating include/curl/Makefile
config.status: creating src/Makefile
config.status: creating lib/Makefile
config.status: creating scripts/Makefile
config.status: creating lib/libcurl.vers
config.status: creating tests/Makefile
config.status: creating tests/certs/Makefile
config.status: creating tests/certs/scripts/Makefile
config.status: creating tests/data/Makefile
config.status: creating tests/server/Makefile
config.status: creating tests/libtest/Makefile
config.status: creating tests/unit/Makefile
config.status: creating packages/Makefile
config.status: creating packages/vms/Makefile
config.status: creating curl-config
config.status: creating libcurl.pc
config.status: creating lib/curl_config.h
config.status: executing depfiles commands
config.status: executing libtool commands
configure: amending lib/Makefile
configure: amending src/Makefile
configure: amending tests/unit/Makefile
configure: amending tests/server/Makefile
configure: amending tests/libtest/Makefile
configure: amending docs/examples/Makefile
configure: Configured to build curl/libcurl:

Host setup: i686-w64-mingw32
Install prefix: /mingw32
Compiler: i686-w64-mingw32-gcc
CFLAGS: -Werror-implicit-function-declaration -g -O0 -pedantic -Wall -W -Wpointer-arith -Wwrite-strings -Wunused -Wshadow -Winline -Wnested-externs -Wmissing-declarations -Wmissing-prototypes -Wno-long-long -Wbad-function-cast -Wfloat-equal -Wno-multichar -Wsign-compare -Wundef -Wno-format-nonliteral -Wendif-labels -Wstrict-prototypes -Wdeclaration-after-statement -Wold-style-definition -Wstrict-aliasing=3 -Wcast-align -Wtype-limits -Wold-style-declaration -Wmissing-parameter-type -Wempty-body -Wclobbered -Wignored-qualifiers -Wconversion -Wno-sign-conversion -Wvla -ftree-vrp -Wno-pedantic-ms-format -Wdouble-promotion -Wformat=2 -Warray-bounds=2 -Wshift-negative-value -Wshift-overflow=2 -Wnull-dereference -fdelete-null-pointer-checks -Wduplicated-cond -Wunused-const-variable -Wduplicated-branches -Wrestrict -Walloc-zero -Wformat-overflow=2 -Wformat-truncation=2 -Wimplicit-fallthrough=4 -Wno-system-headers
CPPFLAGS: -IC:/msys64/mingw32/include -IC:/msys64/mingw32/include -I/tmp/curl_winssl_msys2_mingw32_dbg/libssh2/include -DWINVER=0x0600
LDFLAGS: -LC:/msys64/mingw32/lib -LC:/msys64/mingw32/lib -L/tmp/curl_winssl_msys2_mingw32_dbg/libssh2/lib
LIBS: -lnormaliz -lssh2 -lssh2 -lssl -lcrypto -lssl -lcrypto -lgdi32 -lcrypt32 -lwldap32 -lz -lws2_32

curl version: 7.66.0-DEV
SSL: enabled (Windows-native, OpenSSL)
SSH: enabled (libSSH2)
zlib: enabled
brotli: no (--with-brotli)
GSS-API: no (--with-gssapi)
TLS-SRP: enabled
resolver: POSIX threaded
IPv6: enabled
Unix sockets: no (--enable-unix-sockets)
IDN: enabled (Windows-native)
Build libcurl: Shared=yes, Static=yes
Built-in manual: no (--enable-manual)
--libcurl option: enabled (--disable-libcurl-option)
Verbose errors: enabled (--disable-verbose)
Code coverage: disabled
SSPI: enabled
ca cert bundle: no
ca cert path: no
ca fallback: no
LDAP: enabled (winldap)
LDAPS: enabled
RTSP: enabled
RTMP: no (--with-librtmp)
Metalink: no (--with-libmetalink)
PSL: no (libpsl not found)
Alt-svc: no (--enable-alt-svc)
HTTP2: disabled (--with-nghttp2)
HTTP3: disabled (--with-ngtcp2, --with-quiche)
Protocols: DICT FILE FTP FTPS GOPHER HTTP HTTPS IMAP IMAPS LDAP LDAPS POP3 POP3S RTSP SCP SFTP SMB SMBS SMTP SMTPS TELNET TFTP
Features: SSL IPv6 libz AsynchDNS IDN SSPI SPNEGO Kerberos NTLM TLS-SRP MultiSSL HTTPS-proxy

testcurl: configure seems to have finished fine

testcurl: display libcurl.pc

prefix=/mingw32
exec_prefix=${prefix}
libdir=${exec_prefix}/lib
includedir=${prefix}/include
supported_protocols="DICT FILE FTP FTPS GOPHER HTTP HTTPS IMAP IMAPS LDAP LDAPS POP3 POP3S RTSP SCP SFTP SMB SMBS SMTP SMTPS TELNET TFTP"
supported_features="SSL IPv6 libz AsynchDNS IDN SSPI SPNEGO Kerberos NTLM TLS-SRP MultiSSL HTTPS-proxy"
Name: libcurl
URL: https://curl.haxx.se/
Description: Library to transfer files with ftp, http, etc.
Version: 7.66.0-DEV
Libs: -L${libdir} -lcurl
Libs.private: -lnormaliz -lssh2 -lssh2 -lssl -lcrypto -lssl -lcrypto -lgdi32 -lcrypt32 -lwldap32 -lz -lws2_32
Cflags: -I${includedir}

testcurl: display lib/curl_config.h

#define CURLDEBUG 1
#define CURL_SA_FAMILY_T unsigned short
#define CURL_WITH_MULTI_SSL 1
#define DEBUGBUILD 1
#define ENABLE_IPV6 1
#define GETHOSTNAME_TYPE_ARG2 int
#define HAVE_ASSERT_H 1
#define HAVE_BASENAME 1
#define HAVE_BOOL_T 1
#define HAVE_CLOCK_GETTIME_MONOTONIC 1
#define HAVE_CLOSESOCKET 1
#define HAVE_CONNECT 1
#define HAVE_DECL_GETPWUID_R 0
#define HAVE_DECL_GETPWUID_R_MISSING 1
#define HAVE_ERRNO_H 1
#define HAVE_FCNTL_H 1
#define HAVE_FREEADDRINFO 1
#define HAVE_FTRUNCATE 1
#define HAVE_GETADDRINFO 1
#define HAVE_GETADDRINFO_THREADSAFE 1
#define HAVE_GETHOSTBYADDR 1
#define HAVE_GETHOSTBYNAME 1
#define HAVE_GETHOSTNAME 1
#define HAVE_GETPEERNAME 1
#define HAVE_GETSOCKNAME 1
#define HAVE_GETTIMEOFDAY 1
#define HAVE_INTTYPES_H 1
#define HAVE_IOCTLSOCKET 1
#define HAVE_IOCTLSOCKET_FIONBIO 1
#define HAVE_IO_H 1
#define HAVE_LDAP_SSL 1
#define HAVE_LIBGEN_H 1
#define HAVE_LIBSSH2 1
#define HAVE_LIBSSH2_H 1
#define HAVE_LIBSSL 1
#define HAVE_LIBZ 1
#define HAVE_LL 1
#define HAVE_LOCALE_H 1
#define HAVE_LONGLONG 1
#define HAVE_MALLOC_H 1
#define HAVE_MEMORY_H 1
#define HAVE_OPENSSL_CRYPTO_H 1
#define HAVE_OPENSSL_ERR_H 1
#define HAVE_OPENSSL_PEM_H 1
#define HAVE_OPENSSL_RSA_H 1
#define HAVE_OPENSSL_SRP 1
#define HAVE_OPENSSL_SSL_H 1
#define HAVE_OPENSSL_VERSION 1
#define HAVE_OPENSSL_X509_H 1
#define HAVE_PTHREAD_H 1
#define HAVE_RECV 1
#define HAVE_SELECT 1
#define HAVE_SEND 1
#define HAVE_SETJMP_H 1
#define HAVE_SETLOCALE 1
#define HAVE_SETMODE 1
#define HAVE_SETSOCKOPT 1
#define HAVE_SIGNAL 1
#define HAVE_SIGNAL_H 1
#define HAVE_SIG_ATOMIC_T 1
#define HAVE_SOCKADDR_IN6_SIN6_SCOPE_ID 1
#define HAVE_SOCKET 1
#define HAVE_STDBOOL_H 1
#define HAVE_STDINT_H 1
#define HAVE_STDLIB_H 1
#define HAVE_STRCASECMP 1
#define HAVE_STRCMPI 1
#define HAVE_STRDUP 1
#define HAVE_STRICMP 1
#define HAVE_STRINGS_H 1
#define HAVE_STRING_H 1
#define HAVE_STRNCASECMP 1
#define HAVE_STRSTR 1
#define HAVE_STRTOK_R 1
#define HAVE_STRTOLL 1
#define HAVE_STRUCT_SOCKADDR_STORAGE 1
#define HAVE_STRUCT_TIMEVAL 1
#define HAVE_SYS_PARAM_H 1
#define HAVE_SYS_STAT_H 1
#define HAVE_SYS_TIME_H 1
#define HAVE_SYS_TYPES_H 1
#define HAVE_SYS_UTIME_H 1
#define HAVE_TIME_H 1
#define HAVE_UNISTD_H 1
#define HAVE_USLEEP 1
#define HAVE_UTIME 1
#define HAVE_UTIME_H 1
#define HAVE_VARIADIC_MACROS_C99 1
#define HAVE_VARIADIC_MACROS_GCC 1
#define HAVE_WINBER_H 1
#define HAVE_WINDOWS_H 1
#define HAVE_WINLDAP_H 1
#define HAVE_WINSOCK2_H 1
#define HAVE_WINSOCK_H 1
#define HAVE_WS2TCPIP_H 1
#define HAVE_ZLIB_H 1
#define LT_OBJDIR ".libs/"
#define NEED_REENTRANT 1
#define OS "i686-w64-mingw32"
#define PACKAGE "curl"
#define PACKAGE_BUGREPORT "a suitable curl mailing list: https://curl.haxx.se/mail/"
#define PACKAGE_NAME "curl"
#define PACKAGE_STRING "curl -"
#define PACKAGE_TARNAME "curl"
#define PACKAGE_URL ""
#define PACKAGE_VERSION "-"
#define RANDOM_FILE "/dev/urandom"
#define RECV_TYPE_ARG1 SOCKET
#define RECV_TYPE_ARG2 char *
#define RECV_TYPE_ARG3 int
#define RECV_TYPE_ARG4 int
#define RECV_TYPE_RETV int
#define RETSIGTYPE void
#define SELECT_QUAL_ARG5
#define SELECT_TYPE_ARG1 int
#define SELECT_TYPE_ARG234 fd_set *
#define SELECT_TYPE_ARG5 struct timeval *
#define SELECT_TYPE_RETV int
#define SEND_QUAL_ARG2 const
#define SEND_TYPE_ARG1 SOCKET
#define SEND_TYPE_ARG2 char *
#define SEND_TYPE_ARG3 int
#define SEND_TYPE_ARG4 int
#define SEND_TYPE_RETV int
#define SIZEOF_CURL_OFF_T 8
#define SIZEOF_INT 4
#define SIZEOF_LONG 4
#define SIZEOF_OFF_T 8
#define SIZEOF_SHORT 2
#define SIZEOF_SIZE_T 4
#define SIZEOF_TIME_T 4
#define STDC_HEADERS 1
#define TIME_WITH_SYS_TIME 1
#define USE_LIBSSH2 1
#define USE_OPENSSL 1
#define USE_SCHANNEL 1
#define USE_THREADS_POSIX 1
#define USE_TLS_SRP 1
#define USE_WIN32_IDN 1
#define USE_WIN32_LARGE_FILES 1
#define USE_WIN32_LDAP 1
#define USE_WINDOWS_SSPI 1
#define VERSION "-"
#define WANT_IDN_PROTOTYPES 1
#ifndef _ALL_SOURCE
#endif
#ifndef _DARWIN_USE_64_BIT_INODE
# define _DARWIN_USE_64_BIT_INODE 1
#endif
#define _FILE_OFFSET_BITS 64
#define in_addr_t unsigned long
#ifndef __cplusplus
#endif
testcurl: make -i
Making all in lib
make[1]: Entering directory '/build-1440/lib'
make all-am
make[2]: Entering directory '/build-1440/lib'
CC libcurl_la-file.lo
CC libcurl_la-timeval.lo
CC libcurl_la-base64.lo
CC libcurl_la-hostip.lo
CC libcurl_la-progress.lo
CC libcurl_la-formdata.lo
CC libcurl_la-cookie.lo
CC libcurl_la-http.lo
CC libcurl_la-sendf.lo
CC libcurl_la-ftp.lo
CC libcurl_la-url.lo
CC libcurl_la-dict.lo
CC libcurl_la-if2ip.lo
CC libcurl_la-speedcheck.lo
CC libcurl_la-ldap.lo
CC libcurl_la-version.lo
CC libcurl_la-getenv.lo
CC libcurl_la-escape.lo
CC libcurl_la-mprintf.lo
CC libcurl_la-telnet.lo
CC libcurl_la-netrc.lo
CC libcurl_la-getinfo.lo
CC libcurl_la-transfer.lo
CC libcurl_la-strcase.lo
CC libcurl_la-easy.lo
CC libcurl_la-security.lo
CC libcurl_la-curl_fnmatch.lo
CC libcurl_la-fileinfo.lo
CC libcurl_la-ftplistparser.lo
CC libcurl_la-wildcard.lo
CC libcurl_la-krb5.lo
CC libcurl_la-memdebug.lo
CC libcurl_la-http_chunks.lo
CC libcurl_la-strtok.lo
CC libcurl_la-connect.lo
CC libcurl_la-llist.lo
CC libcurl_la-hash.lo
CC libcurl_la-multi.lo
CC libcurl_la-content_encoding.lo
CC libcurl_la-share.lo
CC libcurl_la-http_digest.lo
CC libcurl_la-md4.lo
CC libcurl_la-md5.lo
CC libcurl_la-http_negotiate.lo
CC libcurl_la-inet_pton.lo
CC libcurl_la-strtoofft.lo
CC libcurl_la-strerror.lo
CC libcurl_la-amigaos.lo
CC libcurl_la-hostasyn.lo
CC libcurl_la-hostip4.lo
CC libcurl_la-hostip6.lo
CC libcurl_la-hostsyn.lo
CC libcurl_la-inet_ntop.lo
CC libcurl_la-parsedate.lo
CC libcurl_la-select.lo
CC libcurl_la-tftp.lo
CC libcurl_la-splay.lo
CC libcurl_la-strdup.lo
CC libcurl_la-socks.lo
CC libcurl_la-ssh.lo
C:/Buildbot/curl_winssl_msys2_mingw32_dbg/build/lib/ssh.c: In function 'ssh_block_statemach':
goto problem 2
C:/Buildbot/curl_winssl_msys2_mingw32_dbg/build/lib/ssh.c:2825:45: warning: conversion from 'timediff_t' {aka 'long long int'} to 'time_t' {aka 'long int'} may change value [-Wconversion]
2825 | left>1000?1000:left); /* ignore result */
| ~~~~~~~~~~~~~~^~~~~
CC libcurl_la-ssh-libssh.lo
CC libcurl_la-curl_addrinfo.lo
CC libcurl_la-socks_gssapi.lo
CC libcurl_la-socks_sspi.lo
CC libcurl_la-curl_sspi.lo
CC libcurl_la-slist.lo
CC libcurl_la-nonblock.lo
CC libcurl_la-curl_memrchr.lo
CC libcurl_la-imap.lo
CC libcurl_la-pop3.lo
CC libcurl_la-smtp.lo
CC libcurl_la-pingpong.lo
CC libcurl_la-rtsp.lo
CC libcurl_la-curl_threads.lo
CC libcurl_la-warnless.lo
CC libcurl_la-hmac.lo
CC libcurl_la-curl_rtmp.lo
CC libcurl_la-openldap.lo
CC libcurl_la-curl_gethostname.lo
CC libcurl_la-gopher.lo
CC libcurl_la-idn_win32.lo
CC libcurl_la-http_proxy.lo
CC libcurl_la-non-ascii.lo
CC libcurl_la-asyn-ares.lo
CC libcurl_la-asyn-thread.lo
CC libcurl_la-curl_gssapi.lo
CC libcurl_la-http_ntlm.lo
CC libcurl_la-curl_ntlm_wb.lo
CC libcurl_la-curl_ntlm_core.lo
CC libcurl_la-curl_sasl.lo
CC libcurl_la-rand.lo
CC libcurl_la-curl_multibyte.lo
CC libcurl_la-hostcheck.lo
CC libcurl_la-conncache.lo
CC libcurl_la-dotdot.lo
CC libcurl_la-x509asn1.lo
CC libcurl_la-http2.lo
CC libcurl_la-smb.lo
CC libcurl_la-curl_endian.lo
CC libcurl_la-curl_des.lo
CC libcurl_la-system_win32.lo
CC libcurl_la-mime.lo
CC libcurl_la-sha256.lo
CC libcurl_la-setopt.lo
CC libcurl_la-curl_path.lo
CC libcurl_la-curl_ctype.lo
CC libcurl_la-curl_range.lo
CC libcurl_la-psl.lo
CC libcurl_la-doh.lo
CC libcurl_la-urlapi.lo
CC libcurl_la-curl_get_line.lo
CC libcurl_la-altsvc.lo
CC libcurl_la-quic.lo
CC vauth/libcurl_la-vauth.lo
CC vauth/libcurl_la-cleartext.lo
CC vauth/libcurl_la-cram.lo
CC vauth/libcurl_la-digest.lo
CC vauth/libcurl_la-digest_sspi.lo
CC vauth/libcurl_la-krb5_gssapi.lo
CC vauth/libcurl_la-krb5_sspi.lo
CC vauth/libcurl_la-ntlm.lo
CC vauth/libcurl_la-ntlm_sspi.lo
CC vauth/libcurl_la-oauth2.lo
CC vauth/libcurl_la-spnego_gssapi.lo
CC vauth/libcurl_la-spnego_sspi.lo
CC vtls/libcurl_la-openssl.lo
C:/Buildbot/curl_winssl_msys2_mingw32_dbg/build/lib/vtls/openssl.c: In function 'ossl_connect_common':
goto problem 3
C:/Buildbot/curl_winssl_msys2_mingw32_dbg/build/lib/vtls/openssl.c:3541:18: warning: conversion from 'timediff_t' {aka 'long long int'} to 'time_t' {aka 'long int'} may change value [-Wconversion]
3541 | timeout_ms = Curl_timeleft(data, NULL, TRUE);
| ^~~~~~~~~~~~~
goto problem 4
C:/Buildbot/curl_winssl_msys2_mingw32_dbg/build/lib/vtls/openssl.c:3559:18: warning: conversion from 'timediff_t' {aka 'long long int'} to 'time_t' {aka 'long int'} may change value [-Wconversion]
3559 | timeout_ms = Curl_timeleft(data, NULL, TRUE);
| ^~~~~~~~~~~~~
CC vtls/libcurl_la-gtls.lo
CC vtls/libcurl_la-vtls.lo
CC vtls/libcurl_la-nss.lo
CC vtls/libcurl_la-polarssl.lo
CC vtls/libcurl_la-polarssl_threadlock.lo
CC vtls/libcurl_la-wolfssl.lo
CC vtls/libcurl_la-schannel.lo
C:/Buildbot/curl_winssl_msys2_mingw32_dbg/build/lib/vtls/schannel.c: In function 'schannel_connect_common':
goto problem 5
C:/Buildbot/curl_winssl_msys2_mingw32_dbg/build/lib/vtls/schannel.c:1361:18: warning: conversion from 'timediff_t' {aka 'long long int'} to 'time_t' {aka 'long int'} may change value [-Wconversion]
1361 | timeout_ms = Curl_timeleft(data, NULL, TRUE);
| ^~~~~~~~~~~~~
goto problem 6
C:/Buildbot/curl_winssl_msys2_mingw32_dbg/build/lib/vtls/schannel.c:1379:18: warning: conversion from 'timediff_t' {aka 'long long int'} to 'time_t' {aka 'long int'} may change value [-Wconversion]
1379 | timeout_ms = Curl_timeleft(data, NULL, TRUE);
| ^~~~~~~~~~~~~
C:/Buildbot/curl_winssl_msys2_mingw32_dbg/build/lib/vtls/schannel.c: In function 'schannel_send':
goto problem 7
C:/Buildbot/curl_winssl_msys2_mingw32_dbg/build/lib/vtls/schannel.c:1552:18: warning: conversion from 'timediff_t' {aka 'long long int'} to 'time_t' {aka 'long int'} may change value [-Wconversion]
1552 | timeleft = Curl_timeleft(conn->data, NULL, FALSE);
| ^~~~~~~~~~~~~
CC vtls/libcurl_la-schannel_verify.lo
CC vtls/libcurl_la-sectransp.lo
CC vtls/libcurl_la-gskit.lo
CC vtls/libcurl_la-mbedtls.lo
CC vtls/libcurl_la-mesalink.lo
CC vquic/libcurl_la-ngtcp2.lo
CC vquic/libcurl_la-ngtcp2-crypto.lo
CC vquic/libcurl_la-quiche.lo
CCLD libcurl.la
CC libcurlu_la-file.lo
CC libcurlu_la-timeval.lo
CC libcurlu_la-base64.lo
CC libcurlu_la-hostip.lo
CC libcurlu_la-progress.lo
CC libcurlu_la-formdata.lo
CC libcurlu_la-cookie.lo
CC libcurlu_la-http.lo
CC libcurlu_la-sendf.lo
CC libcurlu_la-ftp.lo
CC libcurlu_la-url.lo
CC libcurlu_la-dict.lo
CC libcurlu_la-if2ip.lo
CC libcurlu_la-speedcheck.lo
CC libcurlu_la-ldap.lo
CC libcurlu_la-version.lo
CC libcurlu_la-getenv.lo
CC libcurlu_la-escape.lo
CC libcurlu_la-mprintf.lo
CC libcurlu_la-telnet.lo
CC libcurlu_la-netrc.lo
CC libcurlu_la-getinfo.lo
CC libcurlu_la-transfer.lo
CC libcurlu_la-strcase.lo
CC libcurlu_la-easy.lo
CC libcurlu_la-security.lo
CC libcurlu_la-curl_fnmatch.lo
CC libcurlu_la-fileinfo.lo
CC libcurlu_la-ftplistparser.lo
CC libcurlu_la-wildcard.lo
CC libcurlu_la-krb5.lo
CC libcurlu_la-memdebug.lo
CC libcurlu_la-http_chunks.lo
CC libcurlu_la-strtok.lo
CC libcurlu_la-connect.lo
CC libcurlu_la-llist.lo
CC libcurlu_la-hash.lo
CC libcurlu_la-multi.lo
CC libcurlu_la-content_encoding.lo
CC libcurlu_la-share.lo
CC libcurlu_la-http_digest.lo
CC libcurlu_la-md4.lo
CC libcurlu_la-md5.lo
CC libcurlu_la-http_negotiate.lo
CC libcurlu_la-inet_pton.lo
CC libcurlu_la-strtoofft.lo
CC libcurlu_la-strerror.lo
CC libcurlu_la-amigaos.lo
CC libcurlu_la-hostasyn.lo
CC libcurlu_la-hostip4.lo
CC libcurlu_la-hostip6.lo
CC libcurlu_la-hostsyn.lo
CC libcurlu_la-inet_ntop.lo
CC libcurlu_la-parsedate.lo
CC libcurlu_la-select.lo
CC libcurlu_la-tftp.lo
CC libcurlu_la-splay.lo
CC libcurlu_la-strdup.lo
CC libcurlu_la-socks.lo
CC libcurlu_la-ssh.lo
C:/Buildbot/curl_winssl_msys2_mingw32_dbg/build/lib/ssh.c: In function 'ssh_block_statemach':
goto problem 8
C:/Buildbot/curl_winssl_msys2_mingw32_dbg/build/lib/ssh.c:2825:45: warning: conversion from 'timediff_t' {aka 'long long int'} to 'time_t' {aka 'long int'} may change value [-Wconversion]
2825 | left>1000?1000:left); /* ignore result */
| ~~~~~~~~~~~~~~^~~~~
CC libcurlu_la-ssh-libssh.lo
CC libcurlu_la-curl_addrinfo.lo
CC libcurlu_la-socks_gssapi.lo
CC libcurlu_la-socks_sspi.lo
CC libcurlu_la-curl_sspi.lo
CC libcurlu_la-slist.lo
CC libcurlu_la-nonblock.lo
CC libcurlu_la-curl_memrchr.lo
CC libcurlu_la-imap.lo
CC libcurlu_la-pop3.lo
CC libcurlu_la-smtp.lo
CC libcurlu_la-pingpong.lo
CC libcurlu_la-rtsp.lo
CC libcurlu_la-curl_threads.lo
CC libcurlu_la-warnless.lo
CC libcurlu_la-hmac.lo
CC libcurlu_la-curl_rtmp.lo
CC libcurlu_la-openldap.lo
CC libcurlu_la-curl_gethostname.lo
CC libcurlu_la-gopher.lo
CC libcurlu_la-idn_win32.lo
CC libcurlu_la-http_proxy.lo
CC libcurlu_la-non-ascii.lo
CC libcurlu_la-asyn-ares.lo
CC libcurlu_la-asyn-thread.lo
CC libcurlu_la-curl_gssapi.lo
CC libcurlu_la-http_ntlm.lo
CC libcurlu_la-curl_ntlm_wb.lo
CC libcurlu_la-curl_ntlm_core.lo
CC libcurlu_la-curl_sasl.lo
CC libcurlu_la-rand.lo
CC libcurlu_la-curl_multibyte.lo
CC libcurlu_la-hostcheck.lo
CC libcurlu_la-conncache.lo
CC libcurlu_la-dotdot.lo
CC libcurlu_la-x509asn1.lo
CC libcurlu_la-http2.lo
CC libcurlu_la-smb.lo
CC libcurlu_la-curl_endian.lo
CC libcurlu_la-curl_des.lo
CC libcurlu_la-system_win32.lo
CC libcurlu_la-mime.lo
CC libcurlu_la-sha256.lo
CC libcurlu_la-setopt.lo
CC libcurlu_la-curl_path.lo
CC libcurlu_la-curl_ctype.lo
CC libcurlu_la-curl_range.lo
CC libcurlu_la-psl.lo
CC libcurlu_la-doh.lo
CC libcurlu_la-urlapi.lo
CC libcurlu_la-curl_get_line.lo
CC libcurlu_la-altsvc.lo
CC libcurlu_la-quic.lo
CC vauth/libcurlu_la-vauth.lo
CC vauth/libcurlu_la-cleartext.lo
CC vauth/libcurlu_la-cram.lo
CC vauth/libcurlu_la-digest.lo
CC vauth/libcurlu_la-digest_sspi.lo
CC vauth/libcurlu_la-krb5_gssapi.lo
CC vauth/libcurlu_la-krb5_sspi.lo
CC vauth/libcurlu_la-ntlm.lo
CC vauth/libcurlu_la-ntlm_sspi.lo
CC vauth/libcurlu_la-oauth2.lo
CC vauth/libcurlu_la-spnego_gssapi.lo
CC vauth/libcurlu_la-spnego_sspi.lo
CC vtls/libcurlu_la-openssl.lo
C:/Buildbot/curl_winssl_msys2_mingw32_dbg/build/lib/vtls/openssl.c: In function 'ossl_connect_common':
goto problem 9
C:/Buildbot/curl_winssl_msys2_mingw32_dbg/build/lib/vtls/openssl.c:3541:18: warning: conversion from 'timediff_t' {aka 'long long int'} to 'time_t' {aka 'long int'} may change value [-Wconversion]
3541 | timeout_ms = Curl_timeleft(data, NULL, TRUE);
| ^~~~~~~~~~~~~
goto problem 10
C:/Buildbot/curl_winssl_msys2_mingw32_dbg/build/lib/vtls/openssl.c:3559:18: warning: conversion from 'timediff_t' {aka 'long long int'} to 'time_t' {aka 'long int'} may change value [-Wconversion]
3559 | timeout_ms = Curl_timeleft(data, NULL, TRUE);
| ^~~~~~~~~~~~~
CC vtls/libcurlu_la-gtls.lo
CC vtls/libcurlu_la-vtls.lo
CC vtls/libcurlu_la-nss.lo
CC vtls/libcurlu_la-polarssl.lo
CC vtls/libcurlu_la-polarssl_threadlock.lo
CC vtls/libcurlu_la-wolfssl.lo
CC vtls/libcurlu_la-schannel.lo
C:/Buildbot/curl_winssl_msys2_mingw32_dbg/build/lib/vtls/schannel.c: In function 'schannel_connect_common':
goto problem 11
C:/Buildbot/curl_winssl_msys2_mingw32_dbg/build/lib/vtls/schannel.c:1361:18: warning: conversion from 'timediff_t' {aka 'long long int'} to 'time_t' {aka 'long int'} may change value [-Wconversion]
1361 | timeout_ms = Curl_timeleft(data, NULL, TRUE);
| ^~~~~~~~~~~~~
goto problem 12
C:/Buildbot/curl_winssl_msys2_mingw32_dbg/build/lib/vtls/schannel.c:1379:18: warning: conversion from 'timediff_t' {aka 'long long int'} to 'time_t' {aka 'long int'} may change value [-Wconversion]
1379 | timeout_ms = Curl_timeleft(data, NULL, TRUE);
| ^~~~~~~~~~~~~
C:/Buildbot/curl_winssl_msys2_mingw32_dbg/build/lib/vtls/schannel.c: In function 'schannel_send':
goto problem 13
C:/Buildbot/curl_winssl_msys2_mingw32_dbg/build/lib/vtls/schannel.c:1552:18: warning: conversion from 'timediff_t' {aka 'long long int'} to 'time_t' {aka 'long int'} may change value [-Wconversion]
1552 | timeleft = Curl_timeleft(conn->data, NULL, FALSE);
| ^~~~~~~~~~~~~
CC vtls/libcurlu_la-schannel_verify.lo
CC vtls/libcurlu_la-sectransp.lo
CC vtls/libcurlu_la-gskit.lo
CC vtls/libcurlu_la-mbedtls.lo
CC vtls/libcurlu_la-mesalink.lo
CC vquic/libcurlu_la-ngtcp2.lo
CC vquic/libcurlu_la-ngtcp2-crypto.lo
CC vquic/libcurlu_la-quiche.lo
CCLD libcurlu.la
make[2]: Leaving directory '/build-1440/lib'
make[1]: Leaving directory '/build-1440/lib'
Making all in src
make[1]: Entering directory '/build-1440/src'
Making all in ../docs
make[2]: Entering directory '/build-1440/docs'
Making all in .
make[3]: Entering directory '/build-1440/docs'
if test "..x" != "x" -a -e "/docs/curl.1"; then \
/usr/bin/install -c -m 644 "/docs/curl.1" /build-1440/docs/curl.1; fi
cd cmdline-opts && make
make[4]: Entering directory '/build-1440/docs/cmdline-opts'
/usr/bin/perl /docs/cmdline-opts/gen.pl mainpage /docs/cmdline-opts > ../../docs/curl.1
make[4]: Leaving directory '/build-1440/docs/cmdline-opts'
make[3]: Leaving directory '/build-1440/docs'
Making all in cmdline-opts
make[3]: Entering directory '/build-1440/docs/cmdline-opts'
make[3]: Nothing to be done for 'all'.
make[3]: Leaving directory '/build-1440/docs/cmdline-opts'
make[2]: Leaving directory '/build-1440/docs'
make[2]: Entering directory '/build-1440/src'
CC curl-slist_wc.o
CC curl-tool_binmode.o
CC curl-tool_bname.o
CC curl-tool_cb_dbg.o
CC curl-tool_cb_hdr.o
CC curl-tool_cb_prg.o
CC curl-tool_cb_rea.o
CC curl-tool_cb_see.o
CC curl-tool_cb_wrt.o
CC curl-tool_cfgable.o
CC curl-tool_convert.o
CC curl-tool_dirhie.o
CC curl-tool_doswin.o
CC curl-tool_easysrc.o
CC curl-tool_filetime.o
CC curl-tool_formparse.o
CC curl-tool_getparam.o
CC curl-tool_getpass.o
CC curl-tool_help.o
CC curl-tool_helpers.o
CC curl-tool_homedir.o
HUGE tool_hugehelp.c
CC curl-tool_hugehelp.o
CC curl-tool_libinfo.o
CC curl-tool_main.o
CC curl-tool_metalink.o
CC curl-tool_msgs.o
CC curl-tool_operate.o
CC curl-tool_operhlp.o
CC curl-tool_panykey.o
CC curl-tool_paramhlp.o
CC curl-tool_parsecfg.o
CC curl-tool_progress.o
CC curl-tool_strdup.o
CC curl-tool_setopt.o
CC curl-tool_sleep.o
CC curl-tool_urlglob.o
CC curl-tool_util.o
CC curl-tool_vms.o
CC curl-tool_writeout.o
CC curl-tool_xattr.o
CC ../lib/curl-strtoofft.o
CC ../lib/curl-nonblock.o
CC ../lib/curl-warnless.o
CC ../lib/curl-curl_ctype.o
CCLD curl.exe
libtool: error: Could not determine the host path corresponding to
libtool: error: 'C:/msys64/mingw32/lib:C:/msys64/mingw32/bin:/tmp/curl_winssl_msys2_mingw32_dbg/libssh2/lib:/tmp/curl_winssl_msys2_mingw32_dbg/libssh2/bin:/build-1440/lib/.libs:/mingw32/lib:/mingw32/bin'
libtool: error: Continuing, but uninstalled executables may not work.
CC libcurltool_la-slist_wc.lo
CC libcurltool_la-tool_binmode.lo
CC libcurltool_la-tool_bname.lo
CC libcurltool_la-tool_cb_dbg.lo
CC libcurltool_la-tool_cb_hdr.lo
CC libcurltool_la-tool_cb_prg.lo
CC libcurltool_la-tool_cb_rea.lo
CC libcurltool_la-tool_cb_see.lo
CC libcurltool_la-tool_cb_wrt.lo
CC libcurltool_la-tool_cfgable.lo
CC libcurltool_la-tool_convert.lo
CC libcurltool_la-tool_dirhie.lo
CC libcurltool_la-tool_doswin.lo
CC libcurltool_la-tool_easysrc.lo
CC libcurltool_la-tool_filetime.lo
CC libcurltool_la-tool_formparse.lo
CC libcurltool_la-tool_getparam.lo
CC libcurltool_la-tool_getpass.lo
CC libcurltool_la-tool_help.lo
CC libcurltool_la-tool_helpers.lo
CC libcurltool_la-tool_homedir.lo
CC libcurltool_la-tool_hugehelp.lo
CC libcurltool_la-tool_libinfo.lo
CC libcurltool_la-tool_main.lo
CC libcurltool_la-tool_metalink.lo
CC libcurltool_la-tool_msgs.lo
CC libcurltool_la-tool_operate.lo
CC libcurltool_la-tool_operhlp.lo
CC libcurltool_la-tool_panykey.lo
CC libcurltool_la-tool_paramhlp.lo
CC libcurltool_la-tool_parsecfg.lo
CC libcurltool_la-tool_progress.lo
CC libcurltool_la-tool_strdup.lo
CC libcurltool_la-tool_setopt.lo
CC libcurltool_la-tool_sleep.lo
CC libcurltool_la-tool_urlglob.lo
CC libcurltool_la-tool_util.lo
CC libcurltool_la-tool_vms.lo
CC libcurltool_la-tool_writeout.lo
CC libcurltool_la-tool_xattr.lo
CC ../lib/libcurltool_la-strtoofft.lo
CC ../lib/libcurltool_la-nonblock.lo
CC ../lib/libcurltool_la-warnless.lo
CC ../lib/libcurltool_la-curl_ctype.lo
CCLD libcurltool.la
make[2]: Leaving directory '/build-1440/src'
make[1]: Leaving directory '/build-1440/src'
make[1]: Entering directory '/build-1440'
make[1]: Nothing to be done for 'all-am'.
make[1]: Leaving directory '/build-1440'
testcurl: libcurl was created fine (libcurl.la)
testcurl: curl was created fine (curl.exe)
testcurl: display curl.exe --version output
curl 7.66.0-DEV (i686-w64-mingw32) libcurl/7.66.0-DEV OpenSSL/1.1.1c (Schannel) zlib/1.2.11 WinIDN libssh2/1.7.0_DEV
Release-Date: [unreleased]
Protocols: dict file ftp ftps gopher http https imap imaps ldap ldaps pop3 pop3s rtsp scp sftp smtp smtps telnet tftp
Features: AsynchDNS Debug HTTPS-proxy IDN IPv6 Kerberos Largefile libz MultiSSL NTLM SPNEGO SSL SSPI TLS-SRP TrackMemory
testcurl: make -k TEST_F="-d -a -p -r" test-full
make[1]: Entering directory '/build-1440/tests'
Making all in certs
make[2]: Entering directory '/build-1440/tests/certs'
Making all in scripts
make[3]: Entering directory '/build-1440/tests/certs/scripts'
make[3]: Nothing to be done for 'all'.
make[3]: Leaving directory '/build-1440/tests/certs/scripts'
make[3]: Entering directory '/build-1440/tests/certs'
make[3]: Nothing to be done for 'all-am'.
make[3]: Leaving directory '/build-1440/tests/certs'
make[2]: Leaving directory '/build-1440/tests/certs'
Making all in data
make[2]: Entering directory '/build-1440/tests/data'
make[2]: Nothing to be done for 'all'.
make[2]: Leaving directory '/build-1440/tests/data'
Making all in server
make[2]: Entering directory '/build-1440/tests/server'
CC ../../lib/getpart-mprintf.o
CC ../../lib/getpart-nonblock.o
CC ../../lib/getpart-strtoofft.o
CC ../../lib/getpart-warnless.o
CC ../../lib/getpart-curl_ctype.o
CC getpart-getpart.o
CC ../../lib/getpart-base64.o
CC ../../lib/getpart-memdebug.o
CC getpart-testpart.o
CCLD getpart.exe
libtool: error: Could not determine the host path corresponding to
libtool: error: 'C:/msys64/mingw32/lib:C:/msys64/mingw32/bin:/tmp/curl_winssl_msys2_mingw32_dbg/libssh2/lib:/tmp/curl_winssl_msys2_mingw32_dbg/libssh2/bin'
libtool: error: Continuing, but uninstalled executables may not work.
CC ../../lib/resolve-mprintf.o
CC ../../lib/resolve-nonblock.o
CC ../../lib/resolve-strtoofft.o
CC ../../lib/resolve-warnless.o
CC ../../lib/resolve-curl_ctype.o
CC resolve-getpart.o
CC ../../lib/resolve-base64.o
CC ../../lib/resolve-memdebug.o
CC resolve-util.o
CC resolve-resolve.o
CCLD resolve.exe
libtool: error: Could not determine the host path corresponding to
libtool: error: 'C:/msys64/mingw32/lib:C:/msys64/mingw32/bin:/tmp/curl_winssl_msys2_mingw32_dbg/libssh2/lib:/tmp/curl_winssl_msys2_mingw32_dbg/libssh2/bin'
libtool: error: Continuing, but uninstalled executables may not work.
CC ../../lib/rtspd-mprintf.o
CC ../../lib/rtspd-nonblock.o
CC ../../lib/rtspd-strtoofft.o
CC ../../lib/rtspd-warnless.o
CC ../../lib/rtspd-curl_ctype.o
CC rtspd-getpart.o
CC ../../lib/rtspd-base64.o
CC ../../lib/rtspd-memdebug.o
CC rtspd-util.o
CC rtspd-rtspd.o
CCLD rtspd.exe
libtool: error: Could not determine the host path corresponding to
libtool: error: 'C:/msys64/mingw32/lib:C:/msys64/mingw32/bin:/tmp/curl_winssl_msys2_mingw32_dbg/libssh2/lib:/tmp/curl_winssl_msys2_mingw32_dbg/libssh2/bin'
libtool: error: Continuing, but uninstalled executables may not work.
CC ../../lib/sockfilt-mprintf.o
CC ../../lib/sockfilt-nonblock.o
CC ../../lib/sockfilt-strtoofft.o
CC ../../lib/sockfilt-warnless.o
CC ../../lib/sockfilt-curl_ctype.o
CC sockfilt-getpart.o
CC ../../lib/sockfilt-base64.o
CC ../../lib/sockfilt-memdebug.o
CC sockfilt-util.o
CC sockfilt-sockfilt.o
CC ../../lib/sockfilt-inet_pton.o
CCLD sockfilt.exe
libtool: error: Could not determine the host path corresponding to
libtool: error: 'C:/msys64/mingw32/lib:C:/msys64/mingw32/bin:/tmp/curl_winssl_msys2_mingw32_dbg/libssh2/lib:/tmp/curl_winssl_msys2_mingw32_dbg/libssh2/bin'
libtool: error: Continuing, but uninstalled executables may not work.
CC ../../lib/sws-mprintf.o
CC ../../lib/sws-nonblock.o
CC ../../lib/sws-strtoofft.o
CC ../../lib/sws-warnless.o
CC ../../lib/sws-curl_ctype.o
CC sws-getpart.o
CC ../../lib/sws-base64.o
CC ../../lib/sws-memdebug.o
CC sws-util.o
CC sws-sws.o
CC ../../lib/sws-inet_pton.o
CCLD sws.exe
libtool: error: Could not determine the host path corresponding to
libtool: error: 'C:/msys64/mingw32/lib:C:/msys64/mingw32/bin:/tmp/curl_winssl_msys2_mingw32_dbg/libssh2/lib:/tmp/curl_winssl_msys2_mingw32_dbg/libssh2/bin'
libtool: error: Continuing, but uninstalled executables may not work.
CC ../../lib/tftpd-mprintf.o
CC ../../lib/tftpd-nonblock.o
CC ../../lib/tftpd-strtoofft.o
CC ../../lib/tftpd-warnless.o
CC ../../lib/tftpd-curl_ctype.o
CC tftpd-getpart.o
CC ../../lib/tftpd-base64.o
CC ../../lib/tftpd-memdebug.o
CC tftpd-util.o
CC tftpd-tftpd.o
CCLD tftpd.exe
libtool: error: Could not determine the host path corresponding to
libtool: error: 'C:/msys64/mingw32/lib:C:/msys64/mingw32/bin:/tmp/curl_winssl_msys2_mingw32_dbg/libssh2/lib:/tmp/curl_winssl_msys2_mingw32_dbg/libssh2/bin'
libtool: error: Continuing, but uninstalled executables may not work.
CC ../../lib/fake_ntlm-mprintf.o
CC ../../lib/fake_ntlm-nonblock.o
CC ../../lib/fake_ntlm-strtoofft.o
CC ../../lib/fake_ntlm-warnless.o
CC ../../lib/fake_ntlm-curl_ctype.o
CC fake_ntlm-getpart.o
CC ../../lib/fake_ntlm-base64.o
CC ../../lib/fake_ntlm-memdebug.o
CC fake_ntlm-util.o
CC fake_ntlm-fake_ntlm.o
CCLD fake_ntlm.exe
libtool: error: Could not determine the host path corresponding to
libtool: error: 'C:/msys64/mingw32/lib:C:/msys64/mingw32/bin:/tmp/curl_winssl_msys2_mingw32_dbg/libssh2/lib:/tmp/curl_winssl_msys2_mingw32_dbg/libssh2/bin'
libtool: error: Continuing, but uninstalled executables may not work.
CC ../../lib/socksd-mprintf.o
CC ../../lib/socksd-nonblock.o
CC ../../lib/socksd-strtoofft.o
CC ../../lib/socksd-warnless.o
CC ../../lib/socksd-curl_ctype.o
CC socksd-getpart.o
CC ../../lib/socksd-base64.o
CC ../../lib/socksd-memdebug.o
CC socksd-util.o
CC socksd-socksd.o
CC ../../lib/socksd-inet_pton.o
CCLD socksd.exe
libtool: error: Could not determine the host path corresponding to
libtool: error: 'C:/msys64/mingw32/lib:C:/msys64/mingw32/bin:/tmp/curl_winssl_msys2_mingw32_dbg/libssh2/lib:/tmp/curl_winssl_msys2_mingw32_dbg/libssh2/bin'
libtool: error: Continuing, but uninstalled executables may not work.
CC disabled.o
CCLD disabled.exe
libtool: error: Could not determine the host path corresponding to
libtool: error: 'C:/msys64/mingw32/lib:C:/msys64/mingw32/bin:/tmp/curl_winssl_msys2_mingw32_dbg/libssh2/lib:/tmp/curl_winssl_msys2_mingw32_dbg/libssh2/bin'
libtool: error: Continuing, but uninstalled executables may not work.
make[2]: Leaving directory '/build-1440/tests/server'
Making all in libtest
make[2]: Entering directory '/build-1440/tests/libtest'
CC chkhostname-chkhostname.o
CC ../../lib/chkhostname-curl_gethostname.o
CCLD chkhostname.exe
libtool: error: Could not determine the host path corresponding to
libtool: error: 'C:/msys64/mingw32/lib:C:/msys64/mingw32/bin:/tmp/curl_winssl_msys2_mingw32_dbg/libssh2/lib:/tmp/curl_winssl_msys2_mingw32_dbg/libssh2/bin'
libtool: error: Continuing, but uninstalled executables may not work.
CC libauthretry-libauthretry.o
CC libauthretry-first.o
CCLD libauthretry.exe
libtool: error: Could not determine the host path corresponding to
libtool: error: 'C:/msys64/mingw32/lib:C:/msys64/mingw32/bin:/tmp/curl_winssl_msys2_mingw32_dbg/libssh2/lib:/tmp/curl_winssl_msys2_mingw32_dbg/libssh2/bin:/build-1440/lib/.libs:/mingw32/lib:/mingw32/bin'
libtool: error: Continuing, but uninstalled executables may not work.
CC libntlmconnect-libntlmconnect.o
CC libntlmconnect-first.o
CC libntlmconnect-testutil.o
CC ../../lib/libntlmconnect-warnless.o
CCLD libntlmconnect.exe
libtool: error: Could not determine the host path corresponding to
libtool: error: 'C:/msys64/mingw32/lib:C:/msys64/mingw32/bin:/tmp/curl_winssl_msys2_mingw32_dbg/libssh2/lib:/tmp/curl_winssl_msys2_mingw32_dbg/libssh2/bin:/build-1440/lib/.libs:/mingw32/lib:/mingw32/bin'
libtool: error: Continuing, but uninstalled executables may not work.
CC chkdecimalpoint-chkdecimalpoint.o
CC ../../lib/chkdecimalpoint-mprintf.o
CC ../../lib/chkdecimalpoint-curl_ctype.o
CCLD chkdecimalpoint.exe
libtool: error: Could not determine the host path corresponding to
libtool: error: 'C:/msys64/mingw32/lib:C:/msys64/mingw32/bin:/tmp/curl_winssl_msys2_mingw32_dbg/libssh2/lib:/tmp/curl_winssl_msys2_mingw32_dbg/libssh2/bin'
libtool: error: Continuing, but uninstalled executables may not work.
CC lib500-lib500.o
CC lib500-first.o
CC lib500-testutil.o
CC lib500-testtrace.o
CCLD lib500.exe
libtool: error: Could not determine the host path corresponding to
libtool: error: 'C:/msys64/mingw32/lib:C:/msys64/mingw32/bin:/tmp/curl_winssl_msys2_mingw32_dbg/libssh2/lib:/tmp/curl_winssl_msys2_mingw32_dbg/libssh2/bin:/build-1440/lib/.libs:/mingw32/lib:/mingw32/bin'
libtool: error: Continuing, but uninstalled executables may not work.
CC lib501-lib501.o
CC lib501-first.o
CCLD lib501.exe
libtool: error: Could not determine the host path corresponding to
libtool: error: 'C:/msys64/mingw32/lib:C:/msys64/mingw32/bin:/tmp/curl_winssl_msys2_mingw32_dbg/libssh2/lib:/tmp/curl_winssl_msys2_mingw32_dbg/libssh2/bin:/build-1440/lib/.libs:/mingw32/lib:/mingw32/bin'
libtool: error: Continuing, but uninstalled executables may not work.
CC lib502-lib502.o
CC lib502-first.o
CC lib502-testutil.o
CC ../../lib/lib502-warnless.o
CCLD lib502.exe
libtool: error: Could not determine the host path corresponding to
libtool: error: 'C:/msys64/mingw32/lib:C:/msys64/mingw32/bin:/tmp/curl_winssl_msys2_mingw32_dbg/libssh2/lib:/tmp/curl_winssl_msys2_mingw32_dbg/libssh2/bin:/build-1440/lib/.libs:/mingw32/lib:/mingw32/bin'
libtool: error: Continuing, but uninstalled executables may not work.
CC lib503-lib503.o
CC lib503-first.o
CC lib503-testutil.o
CC ../../lib/lib503-warnless.o
CCLD lib503.exe
libtool: error: Could not determine the host path corresponding to
libtool: error: 'C:/msys64/mingw32/lib:C:/msys64/mingw32/bin:/tmp/curl_winssl_msys2_mingw32_dbg/libssh2/lib:/tmp/curl_winssl_msys2_mingw32_dbg/libssh2/bin:/build-1440/lib/.libs:/mingw32/lib:/mingw32/bin'
libtool: error: Continuing, but uninstalled executables may not work.
CC lib504-lib504.o
CC lib504-first.o
CC lib504-testutil.o
CC ../../lib/lib504-warnless.o
CCLD lib504.exe
libtool: error: Could not determine the host path corresponding to
libtool: error: 'C:/msys64/mingw32/lib:C:/msys64/mingw32/bin:/tmp/curl_winssl_msys2_mingw32_dbg/libssh2/lib:/tmp/curl_winssl_msys2_mingw32_dbg/libssh2/bin:/build-1440/lib/.libs:/mingw32/lib:/mingw32/bin'
libtool: error: Continuing, but uninstalled executables may not work.
CC lib505-lib505.o
CC lib505-first.o
CCLD lib505.exe
libtool: error: Could not determine the host path corresponding to
libtool: error: 'C:/msys64/mingw32/lib:C:/msys64/mingw32/bin:/tmp/curl_winssl_msys2_mingw32_dbg/libssh2/lib:/tmp/curl_winssl_msys2_mingw32_dbg/libssh2/bin:/build-1440/lib/.libs:/mingw32/lib:/mingw32/bin'
libtool: error: Continuing, but uninstalled executables may not work.
CC lib506-lib506.o
CC lib506-first.o
CCLD lib506.exe
libtool: error: Could not determine the host path corresponding to
libtool: error: 'C:/msys64/mingw32/lib:C:/msys64/mingw32/bin:/tmp/curl_winssl_msys2_mingw32_dbg/libssh2/lib:/tmp/curl_winssl_msys2_mingw32_dbg/libssh2/bin:/build-1440/lib/.libs:/mingw32/lib:/mingw32/bin'
libtool: error: Continuing, but uninstalled executables may not work.
CC lib507-lib507.o
CC lib507-first.o
CC lib507-testutil.o
CC ../../lib/lib507-warnless.o
CCLD lib507.exe
libtool: error: Could not determine the host path corresponding to
libtool: error: 'C:/msys64/mingw32/lib:C:/msys64/mingw32/bin:/tmp/curl_winssl_msys2_mingw32_dbg/libssh2/lib:/tmp/curl_winssl_msys2_mingw32_dbg/libssh2/bin:/build-1440/lib/.libs:/mingw32/lib:/mingw32/bin'
libtool: error: Continuing, but uninstalled executables may not work.
CC lib508-lib508.o
CC lib508-first.o
CCLD lib508.exe
libtool: error: Could not determine the host path corresponding to
libtool: error: 'C:/msys64/mingw32/lib:C:/msys64/mingw32/bin:/tmp/curl_winssl_msys2_mingw32_dbg/libssh2/lib:/tmp/curl_winssl_msys2_mingw32_dbg/libssh2/bin:/build-1440/lib/.libs:/mingw32/lib:/mingw32/bin'
libtool: error: Continuing, but uninstalled executables may not work.
CC lib509-lib509.o
CC lib509-first.o
CCLD lib509.exe
libtool: error: Could not determine the host path corresponding to
libtool: error: 'C:/msys64/mingw32/lib:C:/msys64/mingw32/bin:/tmp/curl_winssl_msys2_mingw32_dbg/libssh2/lib:/tmp/curl_winssl_msys2_mingw32_dbg/libssh2/bin:/build-1440/lib/.libs:/mingw32/lib:/mingw32/bin'
libtool: error: Continuing, but uninstalled executables may not work.
CC lib510-lib510.o
CC lib510-first.o
CCLD lib510.exe
libtool: error: Could not determine the host path corresponding to
libtool: error: 'C:/msys64/mingw32/lib:C:/msys64/mingw32/bin:/tmp/curl_winssl_msys2_mingw32_dbg/libssh2/lib:/tmp/curl_winssl_msys2_mingw32_dbg/libssh2/bin:/build-1440/lib/.libs:/mingw32/lib:/mingw32/bin'
libtool: error: Continuing, but uninstalled executables may not work.
CC lib511-lib511.o
CC lib511-first.o
CCLD lib511.exe
libtool: error: Could not determine the host path corresponding to
libtool: error: 'C:/msys64/mingw32/lib:C:/msys64/mingw32/bin:/tmp/curl_winssl_msys2_mingw32_dbg/libssh2/lib:/tmp/curl_winssl_msys2_mingw32_dbg/libssh2/bin:/build-1440/lib/.libs:/mingw32/lib:/mingw32/bin'
libtool: error: Continuing, but uninstalled executables may not work.
CC lib512-lib512.o
CC lib512-first.o
CCLD lib512.exe
libtool: error: Could not determine the host path corresponding to
libtool: error: 'C:/msys64/mingw32/lib:C:/msys64/mingw32/bin:/tmp/curl_winssl_msys2_mingw32_dbg/libssh2/lib:/tmp/curl_winssl_msys2_mingw32_dbg/libssh2/bin:/build-1440/lib/.libs:/mingw32/lib:/mingw32/bin'
libtool: error: Continuing, but uninstalled executables may not work.
CC lib513-lib513.o
CC lib513-first.o
CCLD lib513.exe
libtool: error: Could not determine the host path corresponding to
libtool: error: 'C:/msys64/mingw32/lib:C:/msys64/mingw32/bin:/tmp/curl_winssl_msys2_mingw32_dbg/libssh2/lib:/tmp/curl_winssl_msys2_mingw32_dbg/libssh2/bin:/build-1440/lib/.libs:/mingw32/lib:/mingw32/bin'
libtool: error: Continuing, but uninstalled executables may not work.
CC lib514-lib514.o
CC lib514-first.o
CCLD lib514.exe
libtool: error: Could not determine the host path corresponding to
libtool: error: 'C:/msys64/mingw32/lib:C:/msys64/mingw32/bin:/tmp/curl_winssl_msys2_mingw32_dbg/libssh2/lib:/tmp/curl_winssl_msys2_mingw32_dbg/libssh2/bin:/build-1440/lib/.libs:/mingw32/lib:/mingw32/bin'
libtool: error: Continuing, but uninstalled executables may not work.
CC lib515-lib515.o
CC lib515-first.o
CCLD lib515.exe
libtool: error: Could not determine the host path corresponding to
libtool: error: 'C:/msys64/mingw32/lib:C:/msys64/mingw32/bin:/tmp/curl_winssl_msys2_mingw32_dbg/libssh2/lib:/tmp/curl_winssl_msys2_mingw32_dbg/libssh2/bin:/build-1440/lib/.libs:/mingw32/lib:/mingw32/bin'
libtool: error: Continuing, but uninstalled executables may not work.
CC lib516-lib516.o
CC lib516-first.o
CCLD lib516.exe
libtool: error: Could not determine the host path corresponding to
libtool: error: 'C:/msys64/mingw32/lib:C:/msys64/mingw32/bin:/tmp/curl_winssl_msys2_mingw32_dbg/libssh2/lib:/tmp/curl_winssl_msys2_mingw32_dbg/libssh2/bin:/build-1440/lib/.libs:/mingw32/lib:/mingw32/bin'
libtool: error: Continuing, but uninstalled executables may not work.
CC lib517-lib517.o
CC lib517-first.o
CCLD lib517.exe
libtool: error: Could not determine the host path corresponding to
libtool: error: 'C:/msys64/mingw32/lib:C:/msys64/mingw32/bin:/tmp/curl_winssl_msys2_mingw32_dbg/libssh2/lib:/tmp/curl_winssl_msys2_mingw32_dbg/libssh2/bin:/build-1440/lib/.libs:/mingw32/lib:/mingw32/bin'
libtool: error: Continuing, but uninstalled executables may not work.
CC lib518-lib518.o
CC lib518-first.o
CC ../../lib/lib518-warnless.o
CCLD lib518.exe
libtool: error: Could not determine the host path corresponding to
libtool: error: 'C:/msys64/mingw32/lib:C:/msys64/mingw32/bin:/tmp/curl_winssl_msys2_mingw32_dbg/libssh2/lib:/tmp/curl_winssl_msys2_mingw32_dbg/libssh2/bin:/build-1440/lib/.libs:/mingw32/lib:/mingw32/bin'
libtool: error: Continuing, but uninstalled executables may not work.
CC lib519-lib519.o
CC lib519-first.o
CCLD lib519.exe
libtool: error: Could not determine the host path corresponding to
libtool: error: 'C:/msys64/mingw32/lib:C:/msys64/mingw32/bin:/tmp/curl_winssl_msys2_mingw32_dbg/libssh2/lib:/tmp/curl_winssl_msys2_mingw32_dbg/libssh2/bin:/build-1440/lib/.libs:/mingw32/lib:/mingw32/bin'
libtool: error: Continuing, but uninstalled executables may not work.
CC lib520-lib520.o
CC lib520-first.o
CCLD lib520.exe
libtool: error: Could not determine the host path corresponding to
libtool: error: 'C:/msys64/mingw32/lib:C:/msys64/mingw32/bin:/tmp/curl_winssl_msys2_mingw32_dbg/libssh2/lib:/tmp/curl_winssl_msys2_mingw32_dbg/libssh2/bin:/build-1440/lib/.libs:/mingw32/lib:/mingw32/bin'
libtool: error: Continuing, but uninstalled executables may not work.
CC lib521-lib521.o
CC lib521-first.o
CCLD lib521.exe
libtool: error: Could not determine the host path corresponding to
libtool: error: 'C:/msys64/mingw32/lib:C:/msys64/mingw32/bin:/tmp/curl_winssl_msys2_mingw32_dbg/libssh2/lib:/tmp/curl_winssl_msys2_mingw32_dbg/libssh2/bin:/build-1440/lib/.libs:/mingw32/lib:/mingw32/bin'
libtool: error: Continuing, but uninstalled executables may not work.
CC lib523-lib523.o
CC lib523-first.o
CCLD lib523.exe
libtool: error: Could not determine the host path corresponding to
libtool: error: 'C:/msys64/mingw32/lib:C:/msys64/mingw32/bin:/tmp/curl_winssl_msys2_mingw32_dbg/libssh2/lib:/tmp/curl_winssl_msys2_mingw32_dbg/libssh2/bin:/build-1440/lib/.libs:/mingw32/lib:/mingw32/bin'
libtool: error: Continuing, but uninstalled executables may not work.
CC lib524-lib524.o
CC lib524-first.o
CCLD lib524.exe
libtool: error: Could not determine the host path corresponding to
libtool: error: 'C:/msys64/mingw32/lib:C:/msys64/mingw32/bin:/tmp/curl_winssl_msys2_mingw32_dbg/libssh2/lib:/tmp/curl_winssl_msys2_mingw32_dbg/libssh2/bin:/build-1440/lib/.libs:/mingw32/lib:/mingw32/bin'
libtool: error: Continuing, but uninstalled executables may not work.
CC lib525-lib525.o
CC lib525-first.o
CC lib525-testutil.o
CC ../../lib/lib525-warnless.o
CCLD lib525.exe
libtool: error: Could not determine the host path corresponding to
libtool: error: 'C:/msys64/mingw32/lib:C:/msys64/mingw32/bin:/tmp/curl_winssl_msys2_mingw32_dbg/libssh2/lib:/tmp/curl_winssl_msys2_mingw32_dbg/libssh2/bin:/build-1440/lib/.libs:/mingw32/lib:/mingw32/bin'
libtool: error: Continuing, but uninstalled executables may not work.
CC lib526-lib526.o
CC lib526-first.o
CC lib526-testutil.o
CC ../../lib/lib526-warnless.o
CCLD lib526.exe
libtool: error: Could not determine the host path corresponding to
libtool: error: 'C:/msys64/mingw32/lib:C:/msys64/mingw32/bin:/tmp/curl_winssl_msys2_mingw32_dbg/libssh2/lib:/tmp/curl_winssl_msys2_mingw32_dbg/libssh2/bin:/build-1440/lib/.libs:/mingw32/lib:/mingw32/bin'
libtool: error: Continuing, but uninstalled executables may not work.
CC lib527-lib526.o
CC lib527-first.o
CC lib527-testutil.o
CC ../../lib/lib527-warnless.o
CCLD lib527.exe
libtool: error: Could not determine the host path corresponding to
libtool: error: 'C:/msys64/mingw32/lib:C:/msys64/mingw32/bin:/tmp/curl_winssl_msys2_mingw32_dbg/libssh2/lib:/tmp/curl_winssl_msys2_mingw32_dbg/libssh2/bin:/build-1440/lib/.libs:/mingw32/lib:/mingw32/bin'
libtool: error: Continuing, but uninstalled executables may not work.
CC lib529-lib525.o
CC lib529-first.o
CC lib529-testutil.o
CC ../../lib/lib529-warnless.o
CCLD lib529.exe
libtool: error: Could not determine the host path corresponding to
libtool: error: 'C:/msys64/mingw32/lib:C:/msys64/mingw32/bin:/tmp/curl_winssl_msys2_mingw32_dbg/libssh2/lib:/tmp/curl_winssl_msys2_mingw32_dbg/libssh2/bin:/build-1440/lib/.libs:/mingw32/lib:/mingw32/bin'
libtool: error: Continuing, but uninstalled executables may not work.
CC lib530-lib530.o
CC lib530-first.o
CC lib530-testutil.o
CC ../../lib/lib530-warnless.o
CCLD lib530.exe
libtool: error: Could not determine the host path corresponding to
libtool: error: 'C:/msys64/mingw32/lib:C:/msys64/mingw32/bin:/tmp/curl_winssl_msys2_mingw32_dbg/libssh2/lib:/tmp/curl_winssl_msys2_mingw32_dbg/libssh2/bin:/build-1440/lib/.libs:/mingw32/lib:/mingw32/bin'
libtool: error: Continuing, but uninstalled executables may not work.
CC lib532-lib526.o
CC lib532-first.o
CC lib532-testutil.o
CC ../../lib/lib532-warnless.o
CCLD lib532.exe
libtool: error: Could not determine the host path corresponding to
libtool: error: 'C:/msys64/mingw32/lib:C:/msys64/mingw32/bin:/tmp/curl_winssl_msys2_mingw32_dbg/libssh2/lib:/tmp/curl_winssl_msys2_mingw32_dbg/libssh2/bin:/build-1440/lib/.libs:/mingw32/lib:/mingw32/bin'
libtool: error: Continuing, but uninstalled executables may not work.
CC lib533-lib533.o
CC lib533-first.o
CC lib533-testutil.o
CC ../../lib/lib533-warnless.o
CCLD lib533.exe
libtool: error: Could not determine the host path corresponding to
libtool: error: 'C:/msys64/mingw32/lib:C:/msys64/mingw32/bin:/tmp/curl_winssl_msys2_mingw32_dbg/libssh2/lib:/tmp/curl_winssl_msys2_mingw32_dbg/libssh2/bin:/build-1440/lib/.libs:/mingw32/lib:/mingw32/bin'
libtool: error: Continuing, but uninstalled executables may not work.
CC lib537-lib537.o
CC lib537-first.o
CC ../../lib/lib537-warnless.o
CCLD lib537.exe
libtool: error: Could not determine the host path corresponding to
libtool: error: 'C:/msys64/mingw32/lib:C:/msys64/mingw32/bin:/tmp/curl_winssl_msys2_mingw32_dbg/libssh2/lib:/tmp/curl_winssl_msys2_mingw32_dbg/libssh2/bin:/build-1440/lib/.libs:/mingw32/lib:/mingw32/bin'
libtool: error: Continuing, but uninstalled executables may not work.
CC lib539-lib539.o
CC lib539-first.o
CCLD lib539.exe
libtool: error: Could not determine the host path corresponding to
libtool: error: 'C:/msys64/mingw32/lib:C:/msys64/mingw32/bin:/tmp/curl_winssl_msys2_mingw32_dbg/libssh2/lib:/tmp/curl_winssl_msys2_mingw32_dbg/libssh2/bin:/build-1440/lib/.libs:/mingw32/lib:/mingw32/bin'
libtool: error: Continuing, but uninstalled executables may not work.
CC lib540-lib540.o
CC lib540-first.o
CC lib540-testutil.o
CC ../../lib/lib540-warnless.o
CCLD lib540.exe
libtool: error: Could not determine the host path corresponding to
libtool: error: 'C:/msys64/mingw32/lib:C:/msys64/mingw32/bin:/tmp/curl_winssl_msys2_mingw32_dbg/libssh2/lib:/tmp/curl_winssl_msys2_mingw32_dbg/libssh2/bin:/build-1440/lib/.libs:/mingw32/lib:/mingw32/bin'
libtool: error: Continuing, but uninstalled executables may not work.
CC lib541-lib541.o
CC lib541-first.o
CCLD lib541.exe
libtool: error: Could not determine the host path corresponding to
libtool: error: 'C:/msys64/mingw32/lib:C:/msys64/mingw32/bin:/tmp/curl_winssl_msys2_mingw32_dbg/libssh2/lib:/tmp/curl_winssl_msys2_mingw32_dbg/libssh2/bin:/build-1440/lib/.libs:/mingw32/lib:/mingw32/bin'
libtool: error: Continuing, but uninstalled executables may not work.
CC lib542-lib542.o
CC lib542-first.o
CCLD lib542.exe
libtool: error: Could not determine the host path corresponding to
libtool: error: 'C:/msys64/mingw32/lib:C:/msys64/mingw32/bin:/tmp/curl_winssl_msys2_mingw32_dbg/libssh2/lib:/tmp/curl_winssl_msys2_mingw32_dbg/libssh2/bin:/build-1440/lib/.libs:/mingw32/lib:/mingw32/bin'
libtool: error: Continuing, but uninstalled executables may not work.
CC lib543-lib543.o
CC lib543-first.o
CCLD lib543.exe
libtool: error: Could not determine the host path corresponding to
libtool: error: 'C:/msys64/mingw32/lib:C:/msys64/mingw32/bin:/tmp/curl_winssl_msys2_mingw32_dbg/libssh2/lib:/tmp/curl_winssl_msys2_mingw32_dbg/libssh2/bin:/build-1440/lib/.libs:/mingw32/lib:/mingw32/bin'
libtool: error: Continuing, but uninstalled executables may not work.
CC lib544-lib544.o
CC lib544-first.o
CCLD lib544.exe
libtool: error: Could not determine the host path corresponding to
libtool: error: 'C:/msys64/mingw32/lib:C:/msys64/mingw32/bin:/tmp/curl_winssl_msys2_mingw32_dbg/libssh2/lib:/tmp/curl_winssl_msys2_mingw32_dbg/libssh2/bin:/build-1440/lib/.libs:/mingw32/lib:/mingw32/bin'
libtool: error: Continuing, but uninstalled executables may not work.
CC lib545-lib544.o
CC lib545-first.o
CCLD lib545.exe
libtool: error: Could not determine the host path corresponding to
libtool: error: 'C:/msys64/mingw32/lib:C:/msys64/mingw32/bin:/tmp/curl_winssl_msys2_mingw32_dbg/libssh2/lib:/tmp/curl_winssl_msys2_mingw32_dbg/libssh2/bin:/build-1440/lib/.libs:/mingw32/lib:/mingw32/bin'
libtool: error: Continuing, but uninstalled executables may not work.
CC lib547-lib547.o
CC lib547-first.o
CCLD lib547.exe
libtool: error: Could not determine the host path corresponding to
libtool: error: 'C:/msys64/mingw32/lib:C:/msys64/mingw32/bin:/tmp/curl_winssl_msys2_mingw32_dbg/libssh2/lib:/tmp/curl_winssl_msys2_mingw32_dbg/libssh2/bin:/build-1440/lib/.libs:/mingw32/lib:/mingw32/bin'
libtool: error: Continuing, but uninstalled executables may not work.
CC lib548-lib547.o
CC lib548-first.o
CCLD lib548.exe
libtool: error: Could not determine the host path corresponding to
libtool: error: 'C:/msys64/mingw32/lib:C:/msys64/mingw32/bin:/tmp/curl_winssl_msys2_mingw32_dbg/libssh2/lib:/tmp/curl_winssl_msys2_mingw32_dbg/libssh2/bin:/build-1440/lib/.libs:/mingw32/lib:/mingw32/bin'
libtool: error: Continuing, but uninstalled executables may not work.
CC lib549-lib549.o
CC lib549-first.o
CCLD lib549.exe
libtool: error: Could not determine the host path corresponding to
libtool: error: 'C:/msys64/mingw32/lib:C:/msys64/mingw32/bin:/tmp/curl_winssl_msys2_mingw32_dbg/libssh2/lib:/tmp/curl_winssl_msys2_mingw32_dbg/libssh2/bin:/build-1440/lib/.libs:/mingw32/lib:/mingw32/bin'
libtool: error: Continuing, but uninstalled executables may not work.
CC lib552-lib552.o
CC lib552-first.o
CC ../../lib/lib552-warnless.o
CCLD lib552.exe
libtool: error: Could not determine the host path corresponding to
libtool: error: 'C:/msys64/mingw32/lib:C:/msys64/mingw32/bin:/tmp/curl_winssl_msys2_mingw32_dbg/libssh2/lib:/tmp/curl_winssl_msys2_mingw32_dbg/libssh2/bin:/build-1440/lib/.libs:/mingw32/lib:/mingw32/bin'
libtool: error: Continuing, but uninstalled executables may not work.
CC lib553-lib553.o
CC lib553-first.o
CCLD lib553.exe
libtool: error: Could not determine the host path corresponding to
libtool: error: 'C:/msys64/mingw32/lib:C:/msys64/mingw32/bin:/tmp/curl_winssl_msys2_mingw32_dbg/libssh2/lib:/tmp/curl_winssl_msys2_mingw32_dbg/libssh2/bin:/build-1440/lib/.libs:/mingw32/lib:/mingw32/bin'
libtool: error: Continuing, but uninstalled executables may not work.
CC lib554-lib554.o
CC lib554-first.o
CCLD lib554.exe
libtool: error: Could not determine the host path corresponding to
libtool: error: 'C:/msys64/mingw32/lib:C:/msys64/mingw32/bin:/tmp/curl_winssl_msys2_mingw32_dbg/libssh2/lib:/tmp/curl_winssl_msys2_mingw32_dbg/libssh2/bin:/build-1440/lib/.libs:/mingw32/lib:/mingw32/bin'
libtool: error: Continuing, but uninstalled executables may not work.
CC lib555-lib555.o
CC lib555-first.o
CC lib555-testutil.o
CC ../../lib/lib555-warnless.o
CCLD lib555.exe
libtool: error: Could not determine the host path corresponding to
libtool: error: 'C:/msys64/mingw32/lib:C:/msys64/mingw32/bin:/tmp/curl_winssl_msys2_mingw32_dbg/libssh2/lib:/tmp/curl_winssl_msys2_mingw32_dbg/libssh2/bin:/build-1440/lib/.libs:/mingw32/lib:/mingw32/bin'
libtool: error: Continuing, but uninstalled executables may not work.
CC lib556-lib556.o
CC lib556-first.o
CC ../../lib/lib556-warnless.o
CCLD lib556.exe
libtool: error: Could not determine the host path corresponding to
libtool: error: 'C:/msys64/mingw32/lib:C:/msys64/mingw32/bin:/tmp/curl_winssl_msys2_mingw32_dbg/libssh2/lib:/tmp/curl_winssl_msys2_mingw32_dbg/libssh2/bin:/build-1440/lib/.libs:/mingw32/lib:/mingw32/bin'
libtool: error: Continuing, but uninstalled executables may not work.
CC lib557-lib557.o
CC lib557-first.o
CCLD lib557.exe
libtool: error: Could not determine the host path corresponding to
libtool: error: 'C:/msys64/mingw32/lib:C:/msys64/mingw32/bin:/tmp/curl_winssl_msys2_mingw32_dbg/libssh2/lib:/tmp/curl_winssl_msys2_mingw32_dbg/libssh2/bin:/build-1440/lib/.libs:/mingw32/lib:/mingw32/bin'
libtool: error: Continuing, but uninstalled executables may not work.
CC lib558-lib558.o
CC lib558-first.o
CCLD lib558.exe
libtool: error: Could not determine the host path corresponding to
libtool: error: 'C:/msys64/mingw32/lib:C:/msys64/mingw32/bin:/tmp/curl_winssl_msys2_mingw32_dbg/libssh2/lib:/tmp/curl_winssl_msys2_mingw32_dbg/libssh2/bin:/build-1440/lib/.libs:/mingw32/lib:/mingw32/bin'
libtool: error: Continuing, but uninstalled executables may not work.
CC lib559-lib559.o
CC lib559-first.o
CCLD lib559.exe
libtool: error: Could not determine the host path corresponding to
libtool: error: 'C:/msys64/mingw32/lib:C:/msys64/mingw32/bin:/tmp/curl_winssl_msys2_mingw32_dbg/libssh2/lib:/tmp/curl_winssl_msys2_mingw32_dbg/libssh2/bin:/build-1440/lib/.libs:/mingw32/lib:/mingw32/bin'
libtool: error: Continuing, but uninstalled executables may not work.
CC lib560-lib560.o
CC lib560-first.o
CC lib560-testutil.o
CC ../../lib/lib560-warnless.o
CCLD lib560.exe
libtool: error: Could not determine the host path corresponding to
libtool: error: 'C:/msys64/mingw32/lib:C:/msys64/mingw32/bin:/tmp/curl_winssl_msys2_mingw32_dbg/libssh2/lib:/tmp/curl_winssl_msys2_mingw32_dbg/libssh2/bin:/build-1440/lib/.libs:/mingw32/lib:/mingw32/bin'
libtool: error: Continuing, but uninstalled executables may not work.
CC lib562-lib562.o
CC lib562-first.o
CCLD lib562.exe
libtool: error: Could not determine the host path corresponding to
libtool: error: 'C:/msys64/mingw32/lib:C:/msys64/mingw32/bin:/tmp/curl_winssl_msys2_mingw32_dbg/libssh2/lib:/tmp/curl_winssl_msys2_mingw32_dbg/libssh2/bin:/build-1440/lib/.libs:/mingw32/lib:/mingw32/bin'
libtool: error: Continuing, but uninstalled executables may not work.
CC lib564-lib564.o
CC lib564-first.o
CC lib564-testutil.o
CC ../../lib/lib564-warnless.o
CCLD lib564.exe
libtool: error: Could not determine the host path corresponding to
libtool: error: 'C:/msys64/mingw32/lib:C:/msys64/mingw32/bin:/tmp/curl_winssl_msys2_mingw32_dbg/libssh2/lib:/tmp/curl_winssl_msys2_mingw32_dbg/libssh2/bin:/build-1440/lib/.libs:/mingw32/lib:/mingw32/bin'
libtool: error: Continuing, but uninstalled executables may not work.
CC lib565-lib510.o
CC lib565-first.o
CCLD lib565.exe
libtool: error: Could not determine the host path corresponding to
libtool: error: 'C:/msys64/mingw32/lib:C:/msys64/mingw32/bin:/tmp/curl_winssl_msys2_mingw32_dbg/libssh2/lib:/tmp/curl_winssl_msys2_mingw32_dbg/libssh2/bin:/build-1440/lib/.libs:/mingw32/lib:/mingw32/bin'
libtool: error: Continuing, but uninstalled executables may not work.
CC lib566-lib566.o
CC lib566-first.o
CCLD lib566.exe
libtool: error: Could not determine the host path corresponding to
libtool: error: 'C:/msys64/mingw32/lib:C:/msys64/mingw32/bin:/tmp/curl_winssl_msys2_mingw32_dbg/libssh2/lib:/tmp/curl_winssl_msys2_mingw32_dbg/libssh2/bin:/build-1440/lib/.libs:/mingw32/lib:/mingw32/bin'
libtool: error: Continuing, but uninstalled executables may not work.
CC lib567-lib567.o
CC lib567-first.o
CCLD lib567.exe
libtool: error: Could not determine the host path corresponding to
libtool: error: 'C:/msys64/mingw32/lib:C:/msys64/mingw32/bin:/tmp/curl_winssl_msys2_mingw32_dbg/libssh2/lib:/tmp/curl_winssl_msys2_mingw32_dbg/libssh2/bin:/build-1440/lib/.libs:/mingw32/lib:/mingw32/bin'
libtool: error: Continuing, but uninstalled executables may not work.
CC lib568-lib568.o
CC lib568-first.o
CCLD lib568.exe
libtool: error: Could not determine the host path corresponding to
libtool: error: 'C:/msys64/mingw32/lib:C:/msys64/mingw32/bin:/tmp/curl_winssl_msys2_mingw32_dbg/libssh2/lib:/tmp/curl_winssl_msys2_mingw32_dbg/libssh2/bin:/build-1440/lib/.libs:/mingw32/lib:/mingw32/bin'
libtool: error: Continuing, but uninstalled executables may not work.
CC lib569-lib569.o
CC lib569-first.o
CCLD lib569.exe
libtool: error: Could not determine the host path corresponding to
libtool: error: 'C:/msys64/mingw32/lib:C:/msys64/mingw32/bin:/tmp/curl_winssl_msys2_mingw32_dbg/libssh2/lib:/tmp/curl_winssl_msys2_mingw32_dbg/libssh2/bin:/build-1440/lib/.libs:/mingw32/lib:/mingw32/bin'
libtool: error: Continuing, but uninstalled executables may not work.
CC lib570-lib570.o
CC lib570-first.o
CCLD lib570.exe
libtool: error: Could not determine the host path corresponding to
libtool: error: 'C:/msys64/mingw32/lib:C:/msys64/mingw32/bin:/tmp/curl_winssl_msys2_mingw32_dbg/libssh2/lib:/tmp/curl_winssl_msys2_mingw32_dbg/libssh2/bin:/build-1440/lib/.libs:/mingw32/lib:/mingw32/bin'
libtool: error: Continuing, but uninstalled executables may not work.
CC lib571-lib571.o
CC lib571-first.o
CC ../../lib/lib571-warnless.o
CCLD lib571.exe
libtool: error: Could not determine the host path corresponding to
libtool: error: 'C:/msys64/mingw32/lib:C:/msys64/mingw32/bin:/tmp/curl_winssl_msys2_mingw32_dbg/libssh2/lib:/tmp/curl_winssl_msys2_mingw32_dbg/libssh2/bin:/build-1440/lib/.libs:/mingw32/lib:/mingw32/bin'
libtool: error: Continuing, but uninstalled executables may not work.
CC lib572-lib572.o
CC lib572-first.o
CCLD lib572.exe
libtool: error: Could not determine the host path corresponding to
libtool: error: 'C:/msys64/mingw32/lib:C:/msys64/mingw32/bin:/tmp/curl_winssl_msys2_mingw32_dbg/libssh2/lib:/tmp/curl_winssl_msys2_mingw32_dbg/libssh2/bin:/build-1440/lib/.libs:/mingw32/lib:/mingw32/bin'
libtool: error: Continuing, but uninstalled executables may not work.
CC lib573-lib573.o
CC lib573-first.o
CC lib573-testutil.o
CC ../../lib/lib573-warnless.o
CC lib573-testtrace.o
CCLD lib573.exe
libtool: error: Could not determine the host path corresponding to
libtool: error: 'C:/msys64/mingw32/lib:C:/msys64/mingw32/bin:/tmp/curl_winssl_msys2_mingw32_dbg/libssh2/lib:/tmp/curl_winssl_msys2_mingw32_dbg/libssh2/bin:/build-1440/lib/.libs:/mingw32/lib:/mingw32/bin'
libtool: error: Continuing, but uninstalled executables may not work.
CC lib574-lib574.o
CC lib574-first.o
CCLD lib574.exe
libtool: error: Could not determine the host path corresponding to
libtool: error: 'C:/msys64/mingw32/lib:C:/msys64/mingw32/bin:/tmp/curl_winssl_msys2_mingw32_dbg/libssh2/lib:/tmp/curl_winssl_msys2_mingw32_dbg/libssh2/bin:/build-1440/lib/.libs:/mingw32/lib:/mingw32/bin'
libtool: error: Continuing, but uninstalled executables may not work.
CC lib575-lib575.o
CC lib575-first.o
CC lib575-testutil.o
CC ../../lib/lib575-warnless.o
CCLD lib575.exe
libtool: error: Could not determine the host path corresponding to
libtool: error: 'C:/msys64/mingw32/lib:C:/msys64/mingw32/bin:/tmp/curl_winssl_msys2_mingw32_dbg/libssh2/lib:/tmp/curl_winssl_msys2_mingw32_dbg/libssh2/bin:/build-1440/lib/.libs:/mingw32/lib:/mingw32/bin'
libtool: error: Continuing, but uninstalled executables may not work.
CC lib576-lib576.o
CC lib576-first.o
CCLD lib576.exe
libtool: error: Could not determine the host path corresponding to
libtool: error: 'C:/msys64/mingw32/lib:C:/msys64/mingw32/bin:/tmp/curl_winssl_msys2_mingw32_dbg/libssh2/lib:/tmp/curl_winssl_msys2_mingw32_dbg/libssh2/bin:/build-1440/lib/.libs:/mingw32/lib:/mingw32/bin'
libtool: error: Continuing, but uninstalled executables may not work.
CC lib578-lib578.o
CC lib578-first.o
CCLD lib578.exe
libtool: error: Could not determine the host path corresponding to
libtool: error: 'C:/msys64/mingw32/lib:C:/msys64/mingw32/bin:/tmp/curl_winssl_msys2_mingw32_dbg/libssh2/lib:/tmp/curl_winssl_msys2_mingw32_dbg/libssh2/bin:/build-1440/lib/.libs:/mingw32/lib:/mingw32/bin'
libtool: error: Continuing, but uninstalled executables may not work.
CC lib579-lib579.o
CC lib579-first.o
CCLD lib579.exe
libtool: error: Could not determine the host path corresponding to
libtool: error: 'C:/msys64/mingw32/lib:C:/msys64/mingw32/bin:/tmp/curl_winssl_msys2_mingw32_dbg/libssh2/lib:/tmp/curl_winssl_msys2_mingw32_dbg/libssh2/bin:/build-1440/lib/.libs:/mingw32/lib:/mingw32/bin'
libtool: error: Continuing, but uninstalled executables may not work.
CC lib582-lib582.o
CC lib582-first.o
CC lib582-testutil.o
CC ../../lib/lib582-warnless.o
CCLD lib582.exe
libtool: error: Could not determine the host path corresponding to
libtool: error: 'C:/msys64/mingw32/lib:C:/msys64/mingw32/bin:/tmp/curl_winssl_msys2_mingw32_dbg/libssh2/lib:/tmp/curl_winssl_msys2_mingw32_dbg/libssh2/bin:/build-1440/lib/.libs:/mingw32/lib:/mingw32/bin'
libtool: error: Continuing, but uninstalled executables may not work.
CC lib583-lib583.o
CC lib583-first.o
CCLD lib583.exe
libtool: error: Could not determine the host path corresponding to
libtool: error: 'C:/msys64/mingw32/lib:C:/msys64/mingw32/bin:/tmp/curl_winssl_msys2_mingw32_dbg/libssh2/lib:/tmp/curl_winssl_msys2_mingw32_dbg/libssh2/bin:/build-1440/lib/.libs:/mingw32/lib:/mingw32/bin'
libtool: error: Continuing, but uninstalled executables may not work.
CC lib585-lib500.o
CC lib585-first.o
CC lib585-testutil.o
CC lib585-testtrace.o
CCLD lib585.exe
libtool: error: Could not determine the host path corresponding to
libtool: error: 'C:/msys64/mingw32/lib:C:/msys64/mingw32/bin:/tmp/curl_winssl_msys2_mingw32_dbg/libssh2/lib:/tmp/curl_winssl_msys2_mingw32_dbg/libssh2/bin:/build-1440/lib/.libs:/mingw32/lib:/mingw32/bin'
libtool: error: Continuing, but uninstalled executables may not work.
CC lib586-lib586.o
CC lib586-first.o
CCLD lib586.exe
libtool: error: Could not determine the host path corresponding to
libtool: error: 'C:/msys64/mingw32/lib:C:/msys64/mingw32/bin:/tmp/curl_winssl_msys2_mingw32_dbg/libssh2/lib:/tmp/curl_winssl_msys2_mingw32_dbg/libssh2/bin:/build-1440/lib/.libs:/mingw32/lib:/mingw32/bin'
libtool: error: Continuing, but uninstalled executables may not work.
CC lib587-lib554.o
CC lib587-first.o
CCLD lib587.exe
libtool: error: Could not determine the host path corresponding to
libtool: error: 'C:/msys64/mingw32/lib:C:/msys64/mingw32/bin:/tmp/curl_winssl_msys2_mingw32_dbg/libssh2/lib:/tmp/curl_winssl_msys2_mingw32_dbg/libssh2/bin:/build-1440/lib/.libs:/mingw32/lib:/mingw32/bin'
libtool: error: Continuing, but uninstalled executables may not work.
CC lib589-lib589.o
CC lib589-first.o
CCLD lib589.exe
libtool: error: Could not determine the host path corresponding to
libtool: error: 'C:/msys64/mingw32/lib:C:/msys64/mingw32/bin:/tmp/curl_winssl_msys2_mingw32_dbg/libssh2/lib:/tmp/curl_winssl_msys2_mingw32_dbg/libssh2/bin:/build-1440/lib/.libs:/mingw32/lib:/mingw32/bin'
libtool: error: Continuing, but uninstalled executables may not work.
CC lib590-lib590.o
CC lib590-first.o
CCLD lib590.exe
libtool: error: Could not determine the host path corresponding to
libtool: error: 'C:/msys64/mingw32/lib:C:/msys64/mingw32/bin:/tmp/curl_winssl_msys2_mingw32_dbg/libssh2/lib:/tmp/curl_winssl_msys2_mingw32_dbg/libssh2/bin:/build-1440/lib/.libs:/mingw32/lib:/mingw32/bin'
libtool: error: Continuing, but uninstalled executables may not work.
CC lib591-lib591.o
CC lib591-first.o
CC lib591-testutil.o
CC ../../lib/lib591-warnless.o
CCLD lib591.exe
libtool: error: Could not determine the host path corresponding to
libtool: error: 'C:/msys64/mingw32/lib:C:/msys64/mingw32/bin:/tmp/curl_winssl_msys2_mingw32_dbg/libssh2/lib:/tmp/curl_winssl_msys2_mingw32_dbg/libssh2/bin:/build-1440/lib/.libs:/mingw32/lib:/mingw32/bin'
libtool: error: Continuing, but uninstalled executables may not work.
CC lib597-lib597.o
CC lib597-first.o
CC lib597-testutil.o
CC ../../lib/lib597-warnless.o
CCLD lib597.exe
libtool: error: Could not determine the host path corresponding to
libtool: error: 'C:/msys64/mingw32/lib:C:/msys64/mingw32/bin:/tmp/curl_winssl_msys2_mingw32_dbg/libssh2/lib:/tmp/curl_winssl_msys2_mingw32_dbg/libssh2/bin:/build-1440/lib/.libs:/mingw32/lib:/mingw32/bin'
libtool: error: Continuing, but uninstalled executables may not work.
CC lib598-lib598.o
CC lib598-first.o
CCLD lib598.exe
libtool: error: Could not determine the host path corresponding to
libtool: error: 'C:/msys64/mingw32/lib:C:/msys64/mingw32/bin:/tmp/curl_winssl_msys2_mingw32_dbg/libssh2/lib:/tmp/curl_winssl_msys2_mingw32_dbg/libssh2/bin:/build-1440/lib/.libs:/mingw32/lib:/mingw32/bin'
libtool: error: Continuing, but uninstalled executables may not work.
CC lib599-lib599.o
CC lib599-first.o
CCLD lib599.exe
libtool: error: Could not determine the host path corresponding to
libtool: error: 'C:/msys64/mingw32/lib:C:/msys64/mingw32/bin:/tmp/curl_winssl_msys2_mingw32_dbg/libssh2/lib:/tmp/curl_winssl_msys2_mingw32_dbg/libssh2/bin:/build-1440/lib/.libs:/mingw32/lib:/mingw32/bin'
libtool: error: Continuing, but uninstalled executables may not work.
CC lib643-lib643.o
CC lib643-first.o
CCLD lib643.exe
libtool: error: Could not determine the host path corresponding to
libtool: error: 'C:/msys64/mingw32/lib:C:/msys64/mingw32/bin:/tmp/curl_winssl_msys2_mingw32_dbg/libssh2/lib:/tmp/curl_winssl_msys2_mingw32_dbg/libssh2/bin:/build-1440/lib/.libs:/mingw32/lib:/mingw32/bin'
libtool: error: Continuing, but uninstalled executables may not work.
CC lib644-lib643.o
CC lib644-first.o
CCLD lib644.exe
libtool: error: Could not determine the host path corresponding to
libtool: error: 'C:/msys64/mingw32/lib:C:/msys64/mingw32/bin:/tmp/curl_winssl_msys2_mingw32_dbg/libssh2/lib:/tmp/curl_winssl_msys2_mingw32_dbg/libssh2/bin:/build-1440/lib/.libs:/mingw32/lib:/mingw32/bin'
libtool: error: Continuing, but uninstalled executables may not work.
CC lib645-lib643.o
CC lib645-first.o
CCLD lib645.exe
libtool: error: Could not determine the host path corresponding to
libtool: error: 'C:/msys64/mingw32/lib:C:/msys64/mingw32/bin:/tmp/curl_winssl_msys2_mingw32_dbg/libssh2/lib:/tmp/curl_winssl_msys2_mingw32_dbg/libssh2/bin:/build-1440/lib/.libs:/mingw32/lib:/mingw32/bin'
libtool: error: Continuing, but uninstalled executables may not work.
CC lib650-lib650.o
CC lib650-first.o
CCLD lib650.exe
libtool: error: Could not determine the host path corresponding to
libtool: error: 'C:/msys64/mingw32/lib:C:/msys64/mingw32/bin:/tmp/curl_winssl_msys2_mingw32_dbg/libssh2/lib:/tmp/curl_winssl_msys2_mingw32_dbg/libssh2/bin:/build-1440/lib/.libs:/mingw32/lib:/mingw32/bin'
libtool: error: Continuing, but uninstalled executables may not work.
CC lib651-lib651.o
CC lib651-first.o
CCLD lib651.exe
libtool: error: Could not determine the host path corresponding to
libtool: error: 'C:/msys64/mingw32/lib:C:/msys64/mingw32/bin:/tmp/curl_winssl_msys2_mingw32_dbg/libssh2/lib:/tmp/curl_winssl_msys2_mingw32_dbg/libssh2/bin:/build-1440/lib/.libs:/mingw32/lib:/mingw32/bin'
libtool: error: Continuing, but uninstalled executables may not work.
CC lib652-lib652.o
CC lib652-first.o
CCLD lib652.exe
libtool: error: Could not determine the host path corresponding to
libtool: error: 'C:/msys64/mingw32/lib:C:/msys64/mingw32/bin:/tmp/curl_winssl_msys2_mingw32_dbg/libssh2/lib:/tmp/curl_winssl_msys2_mingw32_dbg/libssh2/bin:/build-1440/lib/.libs:/mingw32/lib:/mingw32/bin'
libtool: error: Continuing, but uninstalled executables may not work.
CC lib653-lib653.o
CC lib653-first.o
CCLD lib653.exe
libtool: error: Could not determine the host path corresponding to
libtool: error: 'C:/msys64/mingw32/lib:C:/msys64/mingw32/bin:/tmp/curl_winssl_msys2_mingw32_dbg/libssh2/lib:/tmp/curl_winssl_msys2_mingw32_dbg/libssh2/bin:/build-1440/lib/.libs:/mingw32/lib:/mingw32/bin'
libtool: error: Continuing, but uninstalled executables may not work.
CC lib654-lib654.o
CC lib654-first.o
CCLD lib654.exe
libtool: error: Could not determine the host path corresponding to
libtool: error: 'C:/msys64/mingw32/lib:C:/msys64/mingw32/bin:/tmp/curl_winssl_msys2_mingw32_dbg/libssh2/lib:/tmp/curl_winssl_msys2_mingw32_dbg/libssh2/bin:/build-1440/lib/.libs:/mingw32/lib:/mingw32/bin'
libtool: error: Continuing, but uninstalled executables may not work.
CC lib655-lib655.o
CC lib655-first.o
CCLD lib655.exe
libtool: error: Could not determine the host path corresponding to
libtool: error: 'C:/msys64/mingw32/lib:C:/msys64/mingw32/bin:/tmp/curl_winssl_msys2_mingw32_dbg/libssh2/lib:/tmp/curl_winssl_msys2_mingw32_dbg/libssh2/bin:/build-1440/lib/.libs:/mingw32/lib:/mingw32/bin'
libtool: error: Continuing, but uninstalled executables may not work.
CC lib658-lib658.o
CC lib658-first.o
CC lib658-testutil.o
CC ../../lib/lib658-warnless.o
CCLD lib658.exe
libtool: error: Could not determine the host path corresponding to
libtool: error: 'C:/msys64/mingw32/lib:C:/msys64/mingw32/bin:/tmp/curl_winssl_msys2_mingw32_dbg/libssh2/lib:/tmp/curl_winssl_msys2_mingw32_dbg/libssh2/bin:/build-1440/lib/.libs:/mingw32/lib:/mingw32/bin'
libtool: error: Continuing, but uninstalled executables may not work.
CC lib659-lib659.o
CC lib659-first.o
CC lib659-testutil.o
CC ../../lib/lib659-warnless.o
CCLD lib659.exe
libtool: error: Could not determine the host path corresponding to
libtool: error: 'C:/msys64/mingw32/lib:C:/msys64/mingw32/bin:/tmp/curl_winssl_msys2_mingw32_dbg/libssh2/lib:/tmp/curl_winssl_msys2_mingw32_dbg/libssh2/bin:/build-1440/lib/.libs:/mingw32/lib:/mingw32/bin'
libtool: error: Continuing, but uninstalled executables may not work.
CC lib1156-lib1156.o
CC lib1156-first.o
CC lib1156-testutil.o
CC ../../lib/lib1156-warnless.o
CCLD lib1156.exe
libtool: error: Could not determine the host path corresponding to
libtool: error: 'C:/msys64/mingw32/lib:C:/msys64/mingw32/bin:/tmp/curl_winssl_msys2_mingw32_dbg/libssh2/lib:/tmp/curl_winssl_msys2_mingw32_dbg/libssh2/bin:/build-1440/lib/.libs:/mingw32/lib:/mingw32/bin'
libtool: error: Continuing, but uninstalled executables may not work.
CC lib1500-lib1500.o
CC lib1500-first.o
CC lib1500-testutil.o
CCLD lib1500.exe
libtool: error: Could not determine the host path corresponding to
libtool: error: 'C:/msys64/mingw32/lib:C:/msys64/mingw32/bin:/tmp/curl_winssl_msys2_mingw32_dbg/libssh2/lib:/tmp/curl_winssl_msys2_mingw32_dbg/libssh2/bin:/build-1440/lib/.libs:/mingw32/lib:/mingw32/bin'
libtool: error: Continuing, but uninstalled executables may not work.
CC lib1501-lib1501.o
CC lib1501-first.o
CC lib1501-testutil.o
CC ../../lib/lib1501-warnless.o
CCLD lib1501.exe
libtool: error: Could not determine the host path corresponding to
libtool: error: 'C:/msys64/mingw32/lib:C:/msys64/mingw32/bin:/tmp/curl_winssl_msys2_mingw32_dbg/libssh2/lib:/tmp/curl_winssl_msys2_mingw32_dbg/libssh2/bin:/build-1440/lib/.libs:/mingw32/lib:/mingw32/bin'
libtool: error: Continuing, but uninstalled executables may not work.
CC lib1502-lib1502.o
CC lib1502-first.o
CC lib1502-testutil.o
CC ../../lib/lib1502-warnless.o
CCLD lib1502.exe
libtool: error: Could not determine the host path corresponding to
libtool: error: 'C:/msys64/mingw32/lib:C:/msys64/mingw32/bin:/tmp/curl_winssl_msys2_mingw32_dbg/libssh2/lib:/tmp/curl_winssl_msys2_mingw32_dbg/libssh2/bin:/build-1440/lib/.libs:/mingw32/lib:/mingw32/bin'
libtool: error: Continuing, but uninstalled executables may not work.
CC lib1503-lib1502.o
CC lib1503-first.o
CC lib1503-testutil.o
CC ../../lib/lib1503-warnless.o
CCLD lib1503.exe
libtool: error: Could not determine the host path corresponding to
libtool: error: 'C:/msys64/mingw32/lib:C:/msys64/mingw32/bin:/tmp/curl_winssl_msys2_mingw32_dbg/libssh2/lib:/tmp/curl_winssl_msys2_mingw32_dbg/libssh2/bin:/build-1440/lib/.libs:/mingw32/lib:/mingw32/bin'
libtool: error: Continuing, but uninstalled executables may not work.
CC lib1504-lib1502.o
CC lib1504-first.o
CC lib1504-testutil.o
CC ../../lib/lib1504-warnless.o
CCLD lib1504.exe
libtool: error: Could not determine the host path corresponding to
libtool: error: 'C:/msys64/mingw32/lib:C:/msys64/mingw32/bin:/tmp/curl_winssl_msys2_mingw32_dbg/libssh2/lib:/tmp/curl_winssl_msys2_mingw32_dbg/libssh2/bin:/build-1440/lib/.libs:/mingw32/lib:/mingw32/bin'
libtool: error: Continuing, but uninstalled executables may not work.
CC lib1505-lib1502.o
CC lib1505-first.o
CC lib1505-testutil.o
CC ../../lib/lib1505-warnless.o
CCLD lib1505.exe
libtool: error: Could not determine the host path corresponding to
libtool: error: 'C:/msys64/mingw32/lib:C:/msys64/mingw32/bin:/tmp/curl_winssl_msys2_mingw32_dbg/libssh2/lib:/tmp/curl_winssl_msys2_mingw32_dbg/libssh2/bin:/build-1440/lib/.libs:/mingw32/lib:/mingw32/bin'
libtool: error: Continuing, but uninstalled executables may not work.
CC lib1506-lib1506.o
CC lib1506-first.o
CC lib1506-testutil.o
CC ../../lib/lib1506-warnless.o
CCLD lib1506.exe
libtool: error: Could not determine the host path corresponding to
libtool: error: 'C:/msys64/mingw32/lib:C:/msys64/mingw32/bin:/tmp/curl_winssl_msys2_mingw32_dbg/libssh2/lib:/tmp/curl_winssl_msys2_mingw32_dbg/libssh2/bin:/build-1440/lib/.libs:/mingw32/lib:/mingw32/bin'
libtool: error: Continuing, but uninstalled executables may not work.
CC lib1507-lib1507.o
CC lib1507-first.o
CC lib1507-testutil.o
CC ../../lib/lib1507-warnless.o
CCLD lib1507.exe
libtool: error: Could not determine the host path corresponding to
libtool: error: 'C:/msys64/mingw32/lib:C:/msys64/mingw32/bin:/tmp/curl_winssl_msys2_mingw32_dbg/libssh2/lib:/tmp/curl_winssl_msys2_mingw32_dbg/libssh2/bin:/build-1440/lib/.libs:/mingw32/lib:/mingw32/bin'
libtool: error: Continuing, but uninstalled executables may not work.
CC lib1508-lib1508.o
CC lib1508-first.o
CC lib1508-testutil.o
CC ../../lib/lib1508-warnless.o
CCLD lib1508.exe
libtool: error: Could not determine the host path corresponding to
libtool: error: 'C:/msys64/mingw32/lib:C:/msys64/mingw32/bin:/tmp/curl_winssl_msys2_mingw32_dbg/libssh2/lib:/tmp/curl_winssl_msys2_mingw32_dbg/libssh2/bin:/build-1440/lib/.libs:/mingw32/lib:/mingw32/bin'
libtool: error: Continuing, but uninstalled executables may not work.
CC lib1509-lib1509.o
CC lib1509-first.o
CC lib1509-testutil.o
CC ../../lib/lib1509-warnless.o
CCLD lib1509.exe
libtool: error: Could not determine the host path corresponding to
libtool: error: 'C:/msys64/mingw32/lib:C:/msys64/mingw32/bin:/tmp/curl_winssl_msys2_mingw32_dbg/libssh2/lib:/tmp/curl_winssl_msys2_mingw32_dbg/libssh2/bin:/build-1440/lib/.libs:/mingw32/lib:/mingw32/bin'
libtool: error: Continuing, but uninstalled executables may not work.
CC lib1510-lib1510.o
CC lib1510-first.o
CC lib1510-testutil.o
CC ../../lib/lib1510-warnless.o
CCLD lib1510.exe
libtool: error: Could not determine the host path corresponding to
libtool: error: 'C:/msys64/mingw32/lib:C:/msys64/mingw32/bin:/tmp/curl_winssl_msys2_mingw32_dbg/libssh2/lib:/tmp/curl_winssl_msys2_mingw32_dbg/libssh2/bin:/build-1440/lib/.libs:/mingw32/lib:/mingw32/bin'
libtool: error: Continuing, but uninstalled executables may not work.
CC lib1511-lib1511.o
CC lib1511-first.o
CC lib1511-testutil.o
CC ../../lib/lib1511-warnless.o
CCLD lib1511.exe
libtool: error: Could not determine the host path corresponding to
libtool: error: 'C:/msys64/mingw32/lib:C:/msys64/mingw32/bin:/tmp/curl_winssl_msys2_mingw32_dbg/libssh2/lib:/tmp/curl_winssl_msys2_mingw32_dbg/libssh2/bin:/build-1440/lib/.libs:/mingw32/lib:/mingw32/bin'
libtool: error: Continuing, but uninstalled executables may not work.
CC lib1512-lib1512.o
CC lib1512-first.o
CC lib1512-testutil.o
CC ../../lib/lib1512-warnless.o
CCLD lib1512.exe
libtool: error: Could not determine the host path corresponding to
libtool: error: 'C:/msys64/mingw32/lib:C:/msys64/mingw32/bin:/tmp/curl_winssl_msys2_mingw32_dbg/libssh2/lib:/tmp/curl_winssl_msys2_mingw32_dbg/libssh2/bin:/build-1440/lib/.libs:/mingw32/lib:/mingw32/bin'
libtool: error: Continuing, but uninstalled executables may not work.
CC lib1513-lib1513.o
CC lib1513-first.o
CC lib1513-testutil.o
CC ../../lib/lib1513-warnless.o
CCLD lib1513.exe
libtool: error: Could not determine the host path corresponding to
libtool: error: 'C:/msys64/mingw32/lib:C:/msys64/mingw32/bin:/tmp/curl_winssl_msys2_mingw32_dbg/libssh2/lib:/tmp/curl_winssl_msys2_mingw32_dbg/libssh2/bin:/build-1440/lib/.libs:/mingw32/lib:/mingw32/bin'
libtool: error: Continuing, but uninstalled executables may not work.
CC lib1514-lib1514.o
CC lib1514-first.o
CC lib1514-testutil.o
CC ../../lib/lib1514-warnless.o
CCLD lib1514.exe
libtool: error: Could not determine the host path corresponding to
libtool: error: 'C:/msys64/mingw32/lib:C:/msys64/mingw32/bin:/tmp/curl_winssl_msys2_mingw32_dbg/libssh2/lib:/tmp/curl_winssl_msys2_mingw32_dbg/libssh2/bin:/build-1440/lib/.libs:/mingw32/lib:/mingw32/bin'
libtool: error: Continuing, but uninstalled executables may not work.
CC lib1515-lib1515.o
CC lib1515-first.o
CC lib1515-testutil.o
CC ../../lib/lib1515-warnless.o
CCLD lib1515.exe
libtool: error: Could not determine the host path corresponding to
libtool: error: 'C:/msys64/mingw32/lib:C:/msys64/mingw32/bin:/tmp/curl_winssl_msys2_mingw32_dbg/libssh2/lib:/tmp/curl_winssl_msys2_mingw32_dbg/libssh2/bin:/build-1440/lib/.libs:/mingw32/lib:/mingw32/bin'
libtool: error: Continuing, but uninstalled executables may not work.
CC lib1517-lib1517.o
CC lib1517-first.o
CCLD lib1517.exe
libtool: error: Could not determine the host path corresponding to
libtool: error: 'C:/msys64/mingw32/lib:C:/msys64/mingw32/bin:/tmp/curl_winssl_msys2_mingw32_dbg/libssh2/lib:/tmp/curl_winssl_msys2_mingw32_dbg/libssh2/bin:/build-1440/lib/.libs:/mingw32/lib:/mingw32/bin'
libtool: error: Continuing, but uninstalled executables may not work.
CC lib1518-lib1518.o
CC lib1518-first.o
CCLD lib1518.exe
libtool: error: Could not determine the host path corresponding to
libtool: error: 'C:/msys64/mingw32/lib:C:/msys64/mingw32/bin:/tmp/curl_winssl_msys2_mingw32_dbg/libssh2/lib:/tmp/curl_winssl_msys2_mingw32_dbg/libssh2/bin:/build-1440/lib/.libs:/mingw32/lib:/mingw32/bin'
libtool: error: Continuing, but uninstalled executables may not work.
CC lib1520-lib1520.o
CC lib1520-first.o
CCLD lib1520.exe
libtool: error: Could not determine the host path corresponding to
libtool: error: 'C:/msys64/mingw32/lib:C:/msys64/mingw32/bin:/tmp/curl_winssl_msys2_mingw32_dbg/libssh2/lib:/tmp/curl_winssl_msys2_mingw32_dbg/libssh2/bin:/build-1440/lib/.libs:/mingw32/lib:/mingw32/bin'
libtool: error: Continuing, but uninstalled executables may not work.
/usr/bin/perl /tests/libtest/mk-lib1521.pl < /include/curl/curl.h > lib1521.c
CC lib1521-lib1521.o
CC lib1521-first.o
CCLD lib1521.exe
libtool: error: Could not determine the host path corresponding to
libtool: error: 'C:/msys64/mingw32/lib:C:/msys64/mingw32/bin:/tmp/curl_winssl_msys2_mingw32_dbg/libssh2/lib:/tmp/curl_winssl_msys2_mingw32_dbg/libssh2/bin:/build-1440/lib/.libs:/mingw32/lib:/mingw32/bin'
libtool: error: Continuing, but uninstalled executables may not work.
CC lib1522-lib1522.o
CC lib1522-first.o
CCLD lib1522.exe
libtool: error: Could not determine the host path corresponding to
libtool: error: 'C:/msys64/mingw32/lib:C:/msys64/mingw32/bin:/tmp/curl_winssl_msys2_mingw32_dbg/libssh2/lib:/tmp/curl_winssl_msys2_mingw32_dbg/libssh2/bin:/build-1440/lib/.libs:/mingw32/lib:/mingw32/bin'
libtool: error: Continuing, but uninstalled executables may not work.
CC lib1523-lib1523.o
CC lib1523-first.o
CCLD lib1523.exe
libtool: error: Could not determine the host path corresponding to
libtool: error: 'C:/msys64/mingw32/lib:C:/msys64/mingw32/bin:/tmp/curl_winssl_msys2_mingw32_dbg/libssh2/lib:/tmp/curl_winssl_msys2_mingw32_dbg/libssh2/bin:/build-1440/lib/.libs:/mingw32/lib:/mingw32/bin'
libtool: error: Continuing, but uninstalled executables may not work.
CC lib1525-lib1525.o
CC lib1525-first.o
CC lib1525-testutil.o
CC ../../lib/lib1525-warnless.o
CCLD lib1525.exe
libtool: error: Could not determine the host path corresponding to
libtool: error: 'C:/msys64/mingw32/lib:C:/msys64/mingw32/bin:/tmp/curl_winssl_msys2_mingw32_dbg/libssh2/lib:/tmp/curl_winssl_msys2_mingw32_dbg/libssh2/bin:/build-1440/lib/.libs:/mingw32/lib:/mingw32/bin'
libtool: error: Continuing, but uninstalled executables may not work.
CC lib1526-lib1526.o
CC lib1526-first.o
CC lib1526-testutil.o
CC ../../lib/lib1526-warnless.o
CCLD lib1526.exe
libtool: error: Could not determine the host path corresponding to
libtool: error: 'C:/msys64/mingw32/lib:C:/msys64/mingw32/bin:/tmp/curl_winssl_msys2_mingw32_dbg/libssh2/lib:/tmp/curl_winssl_msys2_mingw32_dbg/libssh2/bin:/build-1440/lib/.libs:/mingw32/lib:/mingw32/bin'
libtool: error: Continuing, but uninstalled executables may not work.
CC lib1527-lib1527.o
CC lib1527-first.o
CC lib1527-testutil.o
CC ../../lib/lib1527-warnless.o
CCLD lib1527.exe
libtool: error: Could not determine the host path corresponding to
libtool: error: 'C:/msys64/mingw32/lib:C:/msys64/mingw32/bin:/tmp/curl_winssl_msys2_mingw32_dbg/libssh2/lib:/tmp/curl_winssl_msys2_mingw32_dbg/libssh2/bin:/build-1440/lib/.libs:/mingw32/lib:/mingw32/bin'
libtool: error: Continuing, but uninstalled executables may not work.
CC lib1528-lib1528.o
CC lib1528-first.o
CC lib1528-testutil.o
CC ../../lib/lib1528-warnless.o
CCLD lib1528.exe
libtool: error: Could not determine the host path corresponding to
libtool: error: 'C:/msys64/mingw32/lib:C:/msys64/mingw32/bin:/tmp/curl_winssl_msys2_mingw32_dbg/libssh2/lib:/tmp/curl_winssl_msys2_mingw32_dbg/libssh2/bin:/build-1440/lib/.libs:/mingw32/lib:/mingw32/bin'
libtool: error: Continuing, but uninstalled executables may not work.
CC lib1529-lib1529.o
CC lib1529-first.o
CC lib1529-testutil.o
CC ../../lib/lib1529-warnless.o
CCLD lib1529.exe
libtool: error: Could not determine the host path corresponding to
libtool: error: 'C:/msys64/mingw32/lib:C:/msys64/mingw32/bin:/tmp/curl_winssl_msys2_mingw32_dbg/libssh2/lib:/tmp/curl_winssl_msys2_mingw32_dbg/libssh2/bin:/build-1440/lib/.libs:/mingw32/lib:/mingw32/bin'
libtool: error: Continuing, but uninstalled executables may not work.
CC lib1530-lib1530.o
CC lib1530-first.o
CC lib1530-testutil.o
CC ../../lib/lib1530-warnless.o
CCLD lib1530.exe
libtool: error: Could not determine the host path corresponding to
libtool: error: 'C:/msys64/mingw32/lib:C:/msys64/mingw32/bin:/tmp/curl_winssl_msys2_mingw32_dbg/libssh2/lib:/tmp/curl_winssl_msys2_mingw32_dbg/libssh2/bin:/build-1440/lib/.libs:/mingw32/lib:/mingw32/bin'
libtool: error: Continuing, but uninstalled executables may not work.
CC lib1531-lib1531.o
CC lib1531-first.o
CC lib1531-testutil.o
CC ../../lib/lib1531-warnless.o
CCLD lib1531.exe
libtool: error: Could not determine the host path corresponding to
libtool: error: 'C:/msys64/mingw32/lib:C:/msys64/mingw32/bin:/tmp/curl_winssl_msys2_mingw32_dbg/libssh2/lib:/tmp/curl_winssl_msys2_mingw32_dbg/libssh2/bin:/build-1440/lib/.libs:/mingw32/lib:/mingw32/bin'
libtool: error: Continuing, but uninstalled executables may not work.
CC lib1532-lib1532.o
CC lib1532-first.o
CC lib1532-testutil.o
CC ../../lib/lib1532-warnless.o
CCLD lib1532.exe
libtool: error: Could not determine the host path corresponding to
libtool: error: 'C:/msys64/mingw32/lib:C:/msys64/mingw32/bin:/tmp/curl_winssl_msys2_mingw32_dbg/libssh2/lib:/tmp/curl_winssl_msys2_mingw32_dbg/libssh2/bin:/build-1440/lib/.libs:/mingw32/lib:/mingw32/bin'
libtool: error: Continuing, but uninstalled executables may not work.
CC lib1533-lib1533.o
CC lib1533-first.o
CC lib1533-testutil.o
CC ../../lib/lib1533-warnless.o
CCLD lib1533.exe
libtool: error: Could not determine the host path corresponding to
libtool: error: 'C:/msys64/mingw32/lib:C:/msys64/mingw32/bin:/tmp/curl_winssl_msys2_mingw32_dbg/libssh2/lib:/tmp/curl_winssl_msys2_mingw32_dbg/libssh2/bin:/build-1440/lib/.libs:/mingw32/lib:/mingw32/bin'
libtool: error: Continuing, but uninstalled executables may not work.
CC lib1534-lib1534.o
CC lib1534-first.o
CC lib1534-testutil.o
CC ../../lib/lib1534-warnless.o
CCLD lib1534.exe
libtool: error: Could not determine the host path corresponding to
libtool: error: 'C:/msys64/mingw32/lib:C:/msys64/mingw32/bin:/tmp/curl_winssl_msys2_mingw32_dbg/libssh2/lib:/tmp/curl_winssl_msys2_mingw32_dbg/libssh2/bin:/build-1440/lib/.libs:/mingw32/lib:/mingw32/bin'
libtool: error: Continuing, but uninstalled executables may not work.
CC lib1535-lib1535.o
CC lib1535-first.o
CC lib1535-testutil.o
CC ../../lib/lib1535-warnless.o
CCLD lib1535.exe
libtool: error: Could not determine the host path corresponding to
libtool: error: 'C:/msys64/mingw32/lib:C:/msys64/mingw32/bin:/tmp/curl_winssl_msys2_mingw32_dbg/libssh2/lib:/tmp/curl_winssl_msys2_mingw32_dbg/libssh2/bin:/build-1440/lib/.libs:/mingw32/lib:/mingw32/bin'
libtool: error: Continuing, but uninstalled executables may not work.
CC lib1536-lib1536.o
CC lib1536-first.o
CC lib1536-testutil.o
CC ../../lib/lib1536-warnless.o
CCLD lib1536.exe
libtool: error: Could not determine the host path corresponding to
libtool: error: 'C:/msys64/mingw32/lib:C:/msys64/mingw32/bin:/tmp/curl_winssl_msys2_mingw32_dbg/libssh2/lib:/tmp/curl_winssl_msys2_mingw32_dbg/libssh2/bin:/build-1440/lib/.libs:/mingw32/lib:/mingw32/bin'
libtool: error: Continuing, but uninstalled executables may not work.
CC lib1537-lib1537.o
CC lib1537-first.o
CC lib1537-testutil.o
CC ../../lib/lib1537-warnless.o
CCLD lib1537.exe
libtool: error: Could not determine the host path corresponding to
libtool: error: 'C:/msys64/mingw32/lib:C:/msys64/mingw32/bin:/tmp/curl_winssl_msys2_mingw32_dbg/libssh2/lib:/tmp/curl_winssl_msys2_mingw32_dbg/libssh2/bin:/build-1440/lib/.libs:/mingw32/lib:/mingw32/bin'
libtool: error: Continuing, but uninstalled executables may not work.
CC lib1538-lib1538.o
CC lib1538-first.o
CC lib1538-testutil.o
CC ../../lib/lib1538-warnless.o
CCLD lib1538.exe
libtool: error: Could not determine the host path corresponding to
libtool: error: 'C:/msys64/mingw32/lib:C:/msys64/mingw32/bin:/tmp/curl_winssl_msys2_mingw32_dbg/libssh2/lib:/tmp/curl_winssl_msys2_mingw32_dbg/libssh2/bin:/build-1440/lib/.libs:/mingw32/lib:/mingw32/bin'
libtool: error: Continuing, but uninstalled executables may not work.
CC lib1540-lib1540.o
CC lib1540-first.o
CC lib1540-testutil.o
CC ../../lib/lib1540-warnless.o
CCLD lib1540.exe
libtool: error: Could not determine the host path corresponding to
libtool: error: 'C:/msys64/mingw32/lib:C:/msys64/mingw32/bin:/tmp/curl_winssl_msys2_mingw32_dbg/libssh2/lib:/tmp/curl_winssl_msys2_mingw32_dbg/libssh2/bin:/build-1440/lib/.libs:/mingw32/lib:/mingw32/bin'
libtool: error: Continuing, but uninstalled executables may not work.
CC lib1541-lib1541.o
CC lib1541-first.o
CC lib1541-testutil.o
CC ../../lib/lib1541-warnless.o
CCLD lib1541.exe
libtool: error: Could not determine the host path corresponding to
libtool: error: 'C:/msys64/mingw32/lib:C:/msys64/mingw32/bin:/tmp/curl_winssl_msys2_mingw32_dbg/libssh2/lib:/tmp/curl_winssl_msys2_mingw32_dbg/libssh2/bin:/build-1440/lib/.libs:/mingw32/lib:/mingw32/bin'
libtool: error: Continuing, but uninstalled executables may not work.
CC lib1550-lib1550.o
CC lib1550-first.o
CCLD lib1550.exe
libtool: error: Could not determine the host path corresponding to
libtool: error: 'C:/msys64/mingw32/lib:C:/msys64/mingw32/bin:/tmp/curl_winssl_msys2_mingw32_dbg/libssh2/lib:/tmp/curl_winssl_msys2_mingw32_dbg/libssh2/bin:/build-1440/lib/.libs:/mingw32/lib:/mingw32/bin'
libtool: error: Continuing, but uninstalled executables may not work.
CC lib1551-lib1551.o
CC lib1551-first.o
CCLD lib1551.exe
libtool: error: Could not determine the host path corresponding to
libtool: error: 'C:/msys64/mingw32/lib:C:/msys64/mingw32/bin:/tmp/curl_winssl_msys2_mingw32_dbg/libssh2/lib:/tmp/curl_winssl_msys2_mingw32_dbg/libssh2/bin:/build-1440/lib/.libs:/mingw32/lib:/mingw32/bin'
libtool: error: Continuing, but uninstalled executables may not work.
CC lib1552-lib1552.o
CC lib1552-first.o
CC lib1552-testutil.o
CCLD lib1552.exe
libtool: error: Could not determine the host path corresponding to
libtool: error: 'C:/msys64/mingw32/lib:C:/msys64/mingw32/bin:/tmp/curl_winssl_msys2_mingw32_dbg/libssh2/lib:/tmp/curl_winssl_msys2_mingw32_dbg/libssh2/bin:/build-1440/lib/.libs:/mingw32/lib:/mingw32/bin'
libtool: error: Continuing, but uninstalled executables may not work.
CC lib1553-lib1553.o
CC lib1553-first.o
CC lib1553-testutil.o
CCLD lib1553.exe
libtool: error: Could not determine the host path corresponding to
libtool: error: 'C:/msys64/mingw32/lib:C:/msys64/mingw32/bin:/tmp/curl_winssl_msys2_mingw32_dbg/libssh2/lib:/tmp/curl_winssl_msys2_mingw32_dbg/libssh2/bin:/build-1440/lib/.libs:/mingw32/lib:/mingw32/bin'
libtool: error: Continuing, but uninstalled executables may not work.
CC lib1554-lib1554.o
CC lib1554-first.o
CCLD lib1554.exe
libtool: error: Could not determine the host path corresponding to
libtool: error: 'C:/msys64/mingw32/lib:C:/msys64/mingw32/bin:/tmp/curl_winssl_msys2_mingw32_dbg/libssh2/lib:/tmp/curl_winssl_msys2_mingw32_dbg/libssh2/bin:/build-1440/lib/.libs:/mingw32/lib:/mingw32/bin'
libtool: error: Continuing, but uninstalled executables may not work.
CC lib1555-lib1555.o
CC lib1555-first.o
CC lib1555-testutil.o
CC ../../lib/lib1555-warnless.o
CCLD lib1555.exe
libtool: error: Could not determine the host path corresponding to
libtool: error: 'C:/msys64/mingw32/lib:C:/msys64/mingw32/bin:/tmp/curl_winssl_msys2_mingw32_dbg/libssh2/lib:/tmp/curl_winssl_msys2_mingw32_dbg/libssh2/bin:/build-1440/lib/.libs:/mingw32/lib:/mingw32/bin'
libtool: error: Continuing, but uninstalled executables may not work.
CC lib1556-lib1556.o
CC lib1556-first.o
CC lib1556-testutil.o
CC ../../lib/lib1556-warnless.o
CCLD lib1556.exe
libtool: error: Could not determine the host path corresponding to
libtool: error: 'C:/msys64/mingw32/lib:C:/msys64/mingw32/bin:/tmp/curl_winssl_msys2_mingw32_dbg/libssh2/lib:/tmp/curl_winssl_msys2_mingw32_dbg/libssh2/bin:/build-1440/lib/.libs:/mingw32/lib:/mingw32/bin'
libtool: error: Continuing, but uninstalled executables may not work.
CC lib1557-lib1557.o
CC lib1557-first.o
CC lib1557-testutil.o
CC ../../lib/lib1557-warnless.o
CCLD lib1557.exe
libtool: error: Could not determine the host path corresponding to
libtool: error: 'C:/msys64/mingw32/lib:C:/msys64/mingw32/bin:/tmp/curl_winssl_msys2_mingw32_dbg/libssh2/lib:/tmp/curl_winssl_msys2_mingw32_dbg/libssh2/bin:/build-1440/lib/.libs:/mingw32/lib:/mingw32/bin'
libtool: error: Continuing, but uninstalled executables may not work.
CC lib1558.o
CC first.o
CC testutil.o
CC ../../lib/warnless.o
CCLD lib1558.exe
libtool: error: Could not determine the host path corresponding to
libtool: error: 'C:/msys64/mingw32/lib:C:/msys64/mingw32/bin:/tmp/curl_winssl_msys2_mingw32_dbg/libssh2/lib:/tmp/curl_winssl_msys2_mingw32_dbg/libssh2/bin:/build-1440/lib/.libs:/mingw32/lib:/mingw32/bin'
libtool: error: Continuing, but uninstalled executables may not work.
CC lib1559.o
CCLD lib1559.exe
libtool: error: Could not determine the host path corresponding to
libtool: error: 'C:/msys64/mingw32/lib:C:/msys64/mingw32/bin:/tmp/curl_winssl_msys2_mingw32_dbg/libssh2/lib:/tmp/curl_winssl_msys2_mingw32_dbg/libssh2/bin:/build-1440/lib/.libs:/mingw32/lib:/mingw32/bin'
libtool: error: Continuing, but uninstalled executables may not work.
CC lib1560.o
CCLD lib1560.exe
libtool: error: Could not determine the host path corresponding to
libtool: error: 'C:/msys64/mingw32/lib:C:/msys64/mingw32/bin:/tmp/curl_winssl_msys2_mingw32_dbg/libssh2/lib:/tmp/curl_winssl_msys2_mingw32_dbg/libssh2/bin:/build-1440/lib/.libs:/mingw32/lib:/mingw32/bin'
libtool: error: Continuing, but uninstalled executables may not work.
CC lib1591-lib1591.o
CC lib1591-first.o
CC lib1591-testutil.o
CC ../../lib/lib1591-warnless.o
CCLD lib1591.exe
libtool: error: Could not determine the host path corresponding to
libtool: error: 'C:/msys64/mingw32/lib:C:/msys64/mingw32/bin:/tmp/curl_winssl_msys2_mingw32_dbg/libssh2/lib:/tmp/curl_winssl_msys2_mingw32_dbg/libssh2/bin:/build-1440/lib/.libs:/mingw32/lib:/mingw32/bin'
libtool: error: Continuing, but uninstalled executables may not work.
CC lib1592-lib1592.o
CC lib1592-first.o
CC lib1592-testutil.o
CC ../../lib/lib1592-warnless.o
CCLD lib1592.exe
libtool: error: Could not determine the host path corresponding to
libtool: error: 'C:/msys64/mingw32/lib:C:/msys64/mingw32/bin:/tmp/curl_winssl_msys2_mingw32_dbg/libssh2/lib:/tmp/curl_winssl_msys2_mingw32_dbg/libssh2/bin:/build-1440/lib/.libs:/mingw32/lib:/mingw32/bin'
libtool: error: Continuing, but uninstalled executables may not work.
CC lib1593.o
CCLD lib1593.exe
libtool: error: Could not determine the host path corresponding to
libtool: error: 'C:/msys64/mingw32/lib:C:/msys64/mingw32/bin:/tmp/curl_winssl_msys2_mingw32_dbg/libssh2/lib:/tmp/curl_winssl_msys2_mingw32_dbg/libssh2/bin:/build-1440/lib/.libs:/mingw32/lib:/mingw32/bin'
libtool: error: Continuing, but uninstalled executables may not work.
CC lib1594.o
CCLD lib1594.exe
libtool: error: Could not determine the host path corresponding to
libtool: error: 'C:/msys64/mingw32/lib:C:/msys64/mingw32/bin:/tmp/curl_winssl_msys2_mingw32_dbg/libssh2/lib:/tmp/curl_winssl_msys2_mingw32_dbg/libssh2/bin:/build-1440/lib/.libs:/mingw32/lib:/mingw32/bin'
libtool: error: Continuing, but uninstalled executables may not work.
CC lib1596-lib1594.o
CC lib1596-first.o
CC lib1596-testutil.o
CC ../../lib/lib1596-warnless.o
CCLD lib1596.exe
libtool: error: Could not determine the host path corresponding to
libtool: error: 'C:/msys64/mingw32/lib:C:/msys64/mingw32/bin:/tmp/curl_winssl_msys2_mingw32_dbg/libssh2/lib:/tmp/curl_winssl_msys2_mingw32_dbg/libssh2/bin:/build-1440/lib/.libs:/mingw32/lib:/mingw32/bin'
libtool: error: Continuing, but uninstalled executables may not work.
CC lib1900-lib1900.o
CC lib1900-first.o
CC lib1900-testutil.o
CC ../../lib/lib1900-warnless.o
CCLD lib1900.exe
libtool: error: Could not determine the host path corresponding to
libtool: error: 'C:/msys64/mingw32/lib:C:/msys64/mingw32/bin:/tmp/curl_winssl_msys2_mingw32_dbg/libssh2/lib:/tmp/curl_winssl_msys2_mingw32_dbg/libssh2/bin:/build-1440/lib/.libs:/mingw32/lib:/mingw32/bin'
libtool: error: Continuing, but uninstalled executables may not work.
CC lib1905-lib1905.o
CC lib1905-first.o
CC lib1905-testutil.o
CC ../../lib/lib1905-warnless.o
CCLD lib1905.exe
libtool: error: Could not determine the host path corresponding to
libtool: error: 'C:/msys64/mingw32/lib:C:/msys64/mingw32/bin:/tmp/curl_winssl_msys2_mingw32_dbg/libssh2/lib:/tmp/curl_winssl_msys2_mingw32_dbg/libssh2/bin:/build-1440/lib/.libs:/mingw32/lib:/mingw32/bin'
libtool: error: Continuing, but uninstalled executables may not work.
CC lib1906-lib1906.o
CC lib1906-first.o
CC lib1906-testutil.o
CC ../../lib/lib1906-warnless.o
CCLD lib1906.exe
libtool: error: Could not determine the host path corresponding to
libtool: error: 'C:/msys64/mingw32/lib:C:/msys64/mingw32/bin:/tmp/curl_winssl_msys2_mingw32_dbg/libssh2/lib:/tmp/curl_winssl_msys2_mingw32_dbg/libssh2/bin:/build-1440/lib/.libs:/mingw32/lib:/mingw32/bin'
libtool: error: Continuing, but uninstalled executables may not work.
CC lib2033-libntlmconnect.o
CC lib2033-first.o
CC lib2033-testutil.o
CC ../../lib/lib2033-warnless.o
CCLD lib2033.exe
libtool: error: Could not determine the host path corresponding to
libtool: error: 'C:/msys64/mingw32/lib:C:/msys64/mingw32/bin:/tmp/curl_winssl_msys2_mingw32_dbg/libssh2/lib:/tmp/curl_winssl_msys2_mingw32_dbg/libssh2/bin:/build-1440/lib/.libs:/mingw32/lib:/mingw32/bin'
libtool: error: Continuing, but uninstalled executables may not work.
make[2]: Leaving directory '/build-1440/tests/libtest'
Making all in unit
make[2]: Entering directory '/build-1440/tests/unit'
CC unit1300-unit1300.o
CC ../libtest/unit1300-first.o
CCLD unit1300.exe
libtool: error: Could not determine the host path corresponding to
libtool: error: 'C:/msys64/mingw32/lib:C:/msys64/mingw32/bin:/tmp/curl_winssl_msys2_mingw32_dbg/libssh2/lib:/tmp/curl_winssl_msys2_mingw32_dbg/libssh2/bin:/mingw32/lib:/mingw32/bin'
libtool: error: Continuing, but uninstalled executables may not work.
CC unit1301-unit1301.o
CC ../libtest/unit1301-first.o
CCLD unit1301.exe
libtool: error: Could not determine the host path corresponding to
libtool: error: 'C:/msys64/mingw32/lib:C:/msys64/mingw32/bin:/tmp/curl_winssl_msys2_mingw32_dbg/libssh2/lib:/tmp/curl_winssl_msys2_mingw32_dbg/libssh2/bin:/mingw32/lib:/mingw32/bin'
libtool: error: Continuing, but uninstalled executables may not work.
CC unit1302-unit1302.o
CC ../libtest/unit1302-first.o
CCLD unit1302.exe
libtool: error: Could not determine the host path corresponding to
libtool: error: 'C:/msys64/mingw32/lib:C:/msys64/mingw32/bin:/tmp/curl_winssl_msys2_mingw32_dbg/libssh2/lib:/tmp/curl_winssl_msys2_mingw32_dbg/libssh2/bin:/mingw32/lib:/mingw32/bin'
libtool: error: Continuing, but uninstalled executables may not work.
CC unit1303-unit1303.o
C:/Buildbot/curl_winssl_msys2_mingw32_dbg/build/tests/unit/unit1303.c: In function 'test':
goto problem 14
C:/Buildbot/curl_winssl_msys2_mingw32_dbg/build/tests/unit/unit1303.c:144:16: warning: conversion from 'timediff_t' {aka 'long long int'} to 'time_t' {aka 'long int'} may change value [-Wconversion]
144 | timeout = Curl_timeleft(data, &now, run[i].connecting);
| ^~~~~~~~~~~~~
CC ../libtest/unit1303-first.o
CCLD unit1303.exe
libtool: error: Could not determine the host path corresponding to
libtool: error: 'C:/msys64/mingw32/lib:C:/msys64/mingw32/bin:/tmp/curl_winssl_msys2_mingw32_dbg/libssh2/lib:/tmp/curl_winssl_msys2_mingw32_dbg/libssh2/bin:/mingw32/lib:/mingw32/bin'
libtool: error: Continuing, but uninstalled executables may not work.
CC unit1304-unit1304.o
CC ../libtest/unit1304-first.o
CCLD unit1304.exe
libtool: error: Could not determine the host path corresponding to
libtool: error: 'C:/msys64/mingw32/lib:C:/msys64/mingw32/bin:/tmp/curl_winssl_msys2_mingw32_dbg/libssh2/lib:/tmp/curl_winssl_msys2_mingw32_dbg/libssh2/bin:/mingw32/lib:/mingw32/bin'
libtool: error: Continuing, but uninstalled executables may not work.
CC unit1305-unit1305.o
CC ../libtest/unit1305-first.o
CCLD unit1305.exe
libtool: error: Could not determine the host path corresponding to
libtool: error: 'C:/msys64/mingw32/lib:C:/msys64/mingw32/bin:/tmp/curl_winssl_msys2_mingw32_dbg/libssh2/lib:/tmp/curl_winssl_msys2_mingw32_dbg/libssh2/bin:/mingw32/lib:/mingw32/bin'
libtool: error: Continuing, but uninstalled executables may not work.
CC unit1307-unit1307.o
CC ../libtest/unit1307-first.o
CCLD unit1307.exe
libtool: error: Could not determine the host path corresponding to
libtool: error: 'C:/msys64/mingw32/lib:C:/msys64/mingw32/bin:/tmp/curl_winssl_msys2_mingw32_dbg/libssh2/lib:/tmp/curl_winssl_msys2_mingw32_dbg/libssh2/bin:/mingw32/lib:/mingw32/bin'
libtool: error: Continuing, but uninstalled executables may not work.
CC unit1308-unit1308.o
CC ../libtest/unit1308-first.o
CCLD unit1308.exe
libtool: error: Could not determine the host path corresponding to
libtool: error: 'C:/msys64/mingw32/lib:C:/msys64/mingw32/bin:/tmp/curl_winssl_msys2_mingw32_dbg/libssh2/lib:/tmp/curl_winssl_msys2_mingw32_dbg/libssh2/bin:/mingw32/lib:/mingw32/bin'
libtool: error: Continuing, but uninstalled executables may not work.
CC unit1309-unit1309.o
CC ../libtest/unit1309-first.o
CCLD unit1309.exe
libtool: error: Could not determine the host path corresponding to
libtool: error: 'C:/msys64/mingw32/lib:C:/msys64/mingw32/bin:/tmp/curl_winssl_msys2_mingw32_dbg/libssh2/lib:/tmp/curl_winssl_msys2_mingw32_dbg/libssh2/bin:/mingw32/lib:/mingw32/bin'
libtool: error: Continuing, but uninstalled executables may not work.
CC unit1323-unit1323.o
CC ../libtest/unit1323-first.o
CCLD unit1323.exe
libtool: error: Could not determine the host path corresponding to
libtool: error: 'C:/msys64/mingw32/lib:C:/msys64/mingw32/bin:/tmp/curl_winssl_msys2_mingw32_dbg/libssh2/lib:/tmp/curl_winssl_msys2_mingw32_dbg/libssh2/bin:/mingw32/lib:/mingw32/bin'
libtool: error: Continuing, but uninstalled executables may not work.
CC unit1330-unit1330.o
CC ../libtest/unit1330-first.o
CCLD unit1330.exe
libtool: error: Could not determine the host path corresponding to
libtool: error: 'C:/msys64/mingw32/lib:C:/msys64/mingw32/bin:/tmp/curl_winssl_msys2_mingw32_dbg/libssh2/lib:/tmp/curl_winssl_msys2_mingw32_dbg/libssh2/bin:/mingw32/lib:/mingw32/bin'
libtool: error: Continuing, but uninstalled executables may not work.
CC unit1394-unit1394.o
CC ../libtest/unit1394-first.o
CCLD unit1394.exe
libtool: error: Could not determine the host path corresponding to
libtool: error: 'C:/msys64/mingw32/lib:C:/msys64/mingw32/bin:/tmp/curl_winssl_msys2_mingw32_dbg/libssh2/lib:/tmp/curl_winssl_msys2_mingw32_dbg/libssh2/bin:/build-1440/lib/.libs:/mingw32/lib:/mingw32/bin'
libtool: error: Continuing, but uninstalled executables may not work.
CC unit1395-unit1395.o
CC ../libtest/unit1395-first.o
CCLD unit1395.exe
libtool: error: Could not determine the host path corresponding to
libtool: error: 'C:/msys64/mingw32/lib:C:/msys64/mingw32/bin:/tmp/curl_winssl_msys2_mingw32_dbg/libssh2/lib:/tmp/curl_winssl_msys2_mingw32_dbg/libssh2/bin:/mingw32/lib:/mingw32/bin'
libtool: error: Continuing, but uninstalled executables may not work.
CC unit1396-unit1396.o
CC ../libtest/unit1396-first.o
CCLD unit1396.exe
libtool: error: Could not determine the host path corresponding to
libtool: error: 'C:/msys64/mingw32/lib:C:/msys64/mingw32/bin:/tmp/curl_winssl_msys2_mingw32_dbg/libssh2/lib:/tmp/curl_winssl_msys2_mingw32_dbg/libssh2/bin:/mingw32/lib:/mingw32/bin'
libtool: error: Continuing, but uninstalled executables may not work.
CC unit1397-unit1397.o
CC ../libtest/unit1397-first.o
CCLD unit1397.exe
libtool: error: Could not determine the host path corresponding to
libtool: error: 'C:/msys64/mingw32/lib:C:/msys64/mingw32/bin:/tmp/curl_winssl_msys2_mingw32_dbg/libssh2/lib:/tmp/curl_winssl_msys2_mingw32_dbg/libssh2/bin:/mingw32/lib:/mingw32/bin'
libtool: error: Continuing, but uninstalled executables may not work.
CC unit1398-unit1398.o
CC ../libtest/unit1398-first.o
CCLD unit1398.exe
libtool: error: Could not determine the host path corresponding to
libtool: error: 'C:/msys64/mingw32/lib:C:/msys64/mingw32/bin:/tmp/curl_winssl_msys2_mingw32_dbg/libssh2/lib:/tmp/curl_winssl_msys2_mingw32_dbg/libssh2/bin:/mingw32/lib:/mingw32/bin'
libtool: error: Continuing, but uninstalled executables may not work.
CC unit1399-unit1399.o
In file included from C:/Buildbot/curl_winssl_msys2_mingw32_dbg/build/tests/unit/unit1399.c:22:
C:/Buildbot/curl_winssl_msys2_mingw32_dbg/build/tests/unit/unit1399.c: In function 'expect_timer_seconds':
goto problem 15
C:/Buildbot/curl_winssl_msys2_mingw32_dbg/build/tests/unit/unit1399.c:67:50: warning: conversion from 'timediff_t' {aka 'long long int'} to 'time_t' {aka 'long int'} may change value [-Wconversion]
67 | fail_unless(usec_matches_seconds(data->progress.t_nslookup, seconds), msg);
| ~~~~~~~~~~~~~~^~~~~~~~~~~
C:/Buildbot/curl_winssl_msys2_mingw32_dbg/build/tests/unit/curlcheck.h:33:8: note: in definition of macro 'fail_unless'
33 | if(!(expr)) { \
| ^~~~
goto problem 16
C:/Buildbot/curl_winssl_msys2_mingw32_dbg/build/tests/unit/unit1399.c:68:50: warning: conversion from 'timediff_t' {aka 'long long int'} to 'time_t' {aka 'long int'} may change value [-Wconversion]
68 | fail_unless(usec_matches_seconds(data->progress.t_connect, seconds), msg);
| ~~~~~~~~~~~~~~^~~~~~~~~~
C:/Buildbot/curl_winssl_msys2_mingw32_dbg/build/tests/unit/curlcheck.h:33:8: note: in definition of macro 'fail_unless'
33 | if(!(expr)) { \
| ^~~~
goto problem 17
C:/Buildbot/curl_winssl_msys2_mingw32_dbg/build/tests/unit/unit1399.c:69:50: warning: conversion from 'timediff_t' {aka 'long long int'} to 'time_t' {aka 'long int'} may change value [-Wconversion]
69 | fail_unless(usec_matches_seconds(data->progress.t_appconnect, seconds), msg);
| ~~~~~~~~~~~~~~^~~~~~~~~~~~~
C:/Buildbot/curl_winssl_msys2_mingw32_dbg/build/tests/unit/curlcheck.h:33:8: note: in definition of macro 'fail_unless'
33 | if(!(expr)) { \
| ^~~~
goto problem 18
C:/Buildbot/curl_winssl_msys2_mingw32_dbg/build/tests/unit/unit1399.c:70:50: warning: conversion from 'timediff_t' {aka 'long long int'} to 'time_t' {aka 'long int'} may change value [-Wconversion]
70 | fail_unless(usec_matches_seconds(data->progress.t_pretransfer, seconds),
| ~~~~~~~~~~~~~~^~~~~~~~~~~~~~
C:/Buildbot/curl_winssl_msys2_mingw32_dbg/build/tests/unit/curlcheck.h:33:8: note: in definition of macro 'fail_unless'
33 | if(!(expr)) { \
| ^~~~
goto problem 19
C:/Buildbot/curl_winssl_msys2_mingw32_dbg/build/tests/unit/unit1399.c:72:50: warning: conversion from 'timediff_t' {aka 'long long int'} to 'time_t' {aka 'long int'} may change value [-Wconversion]
72 | fail_unless(usec_matches_seconds(data->progress.t_starttransfer, seconds),
| ~~~~~~~~~~~~~~^~~~~~~~~~~~~~~~
C:/Buildbot/curl_winssl_msys2_mingw32_dbg/build/tests/unit/curlcheck.h:33:8: note: in definition of macro 'fail_unless'
33 | if(!(expr)) { \
| ^~~~
CC ../libtest/unit1399-first.o
CCLD unit1399.exe
libtool: error: Could not determine the host path corresponding to
libtool: error: 'C:/msys64/mingw32/lib:C:/msys64/mingw32/bin:/tmp/curl_winssl_msys2_mingw32_dbg/libssh2/lib:/tmp/curl_winssl_msys2_mingw32_dbg/libssh2/bin:/mingw32/lib:/mingw32/bin'
libtool: error: Continuing, but uninstalled executables may not work.
CC unit1600-unit1600.o
CC ../libtest/unit1600-first.o
CCLD unit1600.exe
libtool: error: Could not determine the host path corresponding to
libtool: error: 'C:/msys64/mingw32/lib:C:/msys64/mingw32/bin:/tmp/curl_winssl_msys2_mingw32_dbg/libssh2/lib:/tmp/curl_winssl_msys2_mingw32_dbg/libssh2/bin:/mingw32/lib:/mingw32/bin'
libtool: error: Continuing, but uninstalled executables may not work.
CC unit1601-unit1601.o
CC ../libtest/unit1601-first.o
CCLD unit1601.exe
libtool: error: Could not determine the host path corresponding to
libtool: error: 'C:/msys64/mingw32/lib:C:/msys64/mingw32/bin:/tmp/curl_winssl_msys2_mingw32_dbg/libssh2/lib:/tmp/curl_winssl_msys2_mingw32_dbg/libssh2/bin:/mingw32/lib:/mingw32/bin'
libtool: error: Continuing, but uninstalled executables may not work.
CC unit1602-unit1602.o
CC ../libtest/unit1602-first.o
CCLD unit1602.exe
libtool: error: Could not determine the host path corresponding to
libtool: error: 'C:/msys64/mingw32/lib:C:/msys64/mingw32/bin:/tmp/curl_winssl_msys2_mingw32_dbg/libssh2/lib:/tmp/curl_winssl_msys2_mingw32_dbg/libssh2/bin:/mingw32/lib:/mingw32/bin'
libtool: error: Continuing, but uninstalled executables may not work.
CC unit1603-unit1603.o
CC ../libtest/unit1603-first.o
CCLD unit1603.exe
libtool: error: Could not determine the host path corresponding to
libtool: error: 'C:/msys64/mingw32/lib:C:/msys64/mingw32/bin:/tmp/curl_winssl_msys2_mingw32_dbg/libssh2/lib:/tmp/curl_winssl_msys2_mingw32_dbg/libssh2/bin:/mingw32/lib:/mingw32/bin'
libtool: error: Continuing, but uninstalled executables may not work.
CC unit1604-unit1604.o
CC ../libtest/unit1604-first.o
CCLD unit1604.exe
libtool: error: Could not determine the host path corresponding to
libtool: error: 'C:/msys64/mingw32/lib:C:/msys64/mingw32/bin:/tmp/curl_winssl_msys2_mingw32_dbg/libssh2/lib:/tmp/curl_winssl_msys2_mingw32_dbg/libssh2/bin:/mingw32/lib:/mingw32/bin'
libtool: error: Continuing, but uninstalled executables may not work.
CC unit1605-unit1605.o
CC ../libtest/unit1605-first.o
CCLD unit1605.exe
libtool: error: Could not determine the host path corresponding to
libtool: error: 'C:/msys64/mingw32/lib:C:/msys64/mingw32/bin:/tmp/curl_winssl_msys2_mingw32_dbg/libssh2/lib:/tmp/curl_winssl_msys2_mingw32_dbg/libssh2/bin:/mingw32/lib:/mingw32/bin'
libtool: error: Continuing, but uninstalled executables may not work.
CC unit1606-unit1606.o
CC ../libtest/unit1606-first.o
CCLD unit1606.exe
libtool: error: Could not determine the host path corresponding to
libtool: error: 'C:/msys64/mingw32/lib:C:/msys64/mingw32/bin:/tmp/curl_winssl_msys2_mingw32_dbg/libssh2/lib:/tmp/curl_winssl_msys2_mingw32_dbg/libssh2/bin:/mingw32/lib:/mingw32/bin'
libtool: error: Continuing, but uninstalled executables may not work.
CC unit1607-unit1607.o
CC ../libtest/unit1607-first.o
CCLD unit1607.exe
libtool: error: Could not determine the host path corresponding to
libtool: error: 'C:/msys64/mingw32/lib:C:/msys64/mingw32/bin:/tmp/curl_winssl_msys2_mingw32_dbg/libssh2/lib:/tmp/curl_winssl_msys2_mingw32_dbg/libssh2/bin:/mingw32/lib:/mingw32/bin'
libtool: error: Continuing, but uninstalled executables may not work.
CC unit1608-unit1608.o
CC ../libtest/unit1608-first.o
CCLD unit1608.exe
libtool: error: Could not determine the host path corresponding to
libtool: error: 'C:/msys64/mingw32/lib:C:/msys64/mingw32/bin:/tmp/curl_winssl_msys2_mingw32_dbg/libssh2/lib:/tmp/curl_winssl_msys2_mingw32_dbg/libssh2/bin:/mingw32/lib:/mingw32/bin'
libtool: error: Continuing, but uninstalled executables may not work.
CC unit1609-unit1609.o
CC ../libtest/unit1609-first.o
CCLD unit1609.exe
libtool: error: Could not determine the host path corresponding to
libtool: error: 'C:/msys64/mingw32/lib:C:/msys64/mingw32/bin:/tmp/curl_winssl_msys2_mingw32_dbg/libssh2/lib:/tmp/curl_winssl_msys2_mingw32_dbg/libssh2/bin:/mingw32/lib:/mingw32/bin'
libtool: error: Continuing, but uninstalled executables may not work.
CC unit1620-unit1620.o
CC ../libtest/unit1620-first.o
CCLD unit1620.exe
libtool: error: Could not determine the host path corresponding to
libtool: error: 'C:/msys64/mingw32/lib:C:/msys64/mingw32/bin:/tmp/curl_winssl_msys2_mingw32_dbg/libssh2/lib:/tmp/curl_winssl_msys2_mingw32_dbg/libssh2/bin:/mingw32/lib:/mingw32/bin'
libtool: error: Continuing, but uninstalled executables may not work.
CC unit1621-unit1621.o
CC ../libtest/unit1621-first.o
CCLD unit1621.exe
libtool: error: Could not determine the host path corresponding to
libtool: error: 'C:/msys64/mingw32/lib:C:/msys64/mingw32/bin:/tmp/curl_winssl_msys2_mingw32_dbg/libssh2/lib:/tmp/curl_winssl_msys2_mingw32_dbg/libssh2/bin:/build-1440/lib/.libs:/mingw32/lib:/mingw32/bin'
libtool: error: Continuing, but uninstalled executables may not work.
CC unit1650-unit1650.o
CC ../libtest/unit1650-first.o
CCLD unit1650.exe
libtool: error: Could not determine the host path corresponding to
libtool: error: 'C:/msys64/mingw32/lib:C:/msys64/mingw32/bin:/tmp/curl_winssl_msys2_mingw32_dbg/libssh2/lib:/tmp/curl_winssl_msys2_mingw32_dbg/libssh2/bin:/mingw32/lib:/mingw32/bin'
libtool: error: Continuing, but uninstalled executables may not work.
CC unit1651-unit1651.o
CC ../libtest/unit1651-first.o
CCLD unit1651.exe
libtool: error: Could not determine the host path corresponding to
libtool: error: 'C:/msys64/mingw32/lib:C:/msys64/mingw32/bin:/tmp/curl_winssl_msys2_mingw32_dbg/libssh2/lib:/tmp/curl_winssl_msys2_mingw32_dbg/libssh2/bin:/mingw32/lib:/mingw32/bin'
libtool: error: Continuing, but uninstalled executables may not work.
CC unit1652-unit1652.o
CC ../libtest/unit1652-first.o
CCLD unit1652.exe
libtool: error: Could not determine the host path corresponding to
libtool: error: 'C:/msys64/mingw32/lib:C:/msys64/mingw32/bin:/tmp/curl_winssl_msys2_mingw32_dbg/libssh2/lib:/tmp/curl_winssl_msys2_mingw32_dbg/libssh2/bin:/mingw32/lib:/mingw32/bin'
libtool: error: Continuing, but uninstalled executables may not work.
CC unit1653-unit1653.o
CC ../libtest/unit1653-first.o
CCLD unit1653.exe
libtool: error: Could not determine the host path corresponding to
libtool: error: 'C:/msys64/mingw32/lib:C:/msys64/mingw32/bin:/tmp/curl_winssl_msys2_mingw32_dbg/libssh2/lib:/tmp/curl_winssl_msys2_mingw32_dbg/libssh2/bin:/mingw32/lib:/mingw32/bin'
libtool: error: Continuing, but uninstalled executables may not work.
CC unit1654-unit1654.o
CC ../libtest/unit1654-first.o
CCLD unit1654.exe
libtool: error: Could not determine the host path corresponding to
libtool: error: 'C:/msys64/mingw32/lib:C:/msys64/mingw32/bin:/tmp/curl_winssl_msys2_mingw32_dbg/libssh2/lib:/tmp/curl_winssl_msys2_mingw32_dbg/libssh2/bin:/mingw32/lib:/mingw32/bin'
libtool: error: Continuing, but uninstalled executables may not work.
make[2]: Leaving directory '/build-1440/tests/unit'
make[2]: Entering directory '/build-1440/tests'
make[2]: Nothing to be done for 'all-am'.
make[2]: Leaving directory '/build-1440/tests'
srcdir=/tests /usr/bin/perl -I/tests /tests/runtests.pl -d -a -p -r
********* System characteristics ********
* curl 7.66.0-DEV (i686-w64-mingw32)
* libcurl/7.66.0-DEV OpenSSL/1.1.1c (Schannel) zlib/1.2.11 WinIDN libssh2/1.7.0_DEV
* Features: AsynchDNS Debug HTTPS-proxy IDN IPv6 Kerberos Largefile libz MultiSSL NTLM SPNEGO SSL SSPI TLS-SRP TrackMemory
* Disabled:
* Host: f74e3c265ec1
* System: MINGW32_NT-10.0 f74e3c265ec1 3.0.7(0.338/5/3) 2019-05-27 06:58 x86_64 Msys
*
*** DISABLES memory tracking when using threaded resolver
*
* Servers: SSL HTTP-IPv6 FTP-IPv6
* Env:
*****************************************
RUN: server/sws --pidfile ".http_server.pid" --logfile "log/http_server.log" --ipv4 --port 8990 --srcdir "/tests"
test 0001...[HTTP GET]
--pd---e--- OK (1 out of 1250, remaining: 52:58, took 2.5s, duration: 00:02)
test 0002...[HTTP GET with user and password]
--pd---e--- OK (2 out of 1250, remaining: 28:34, took 0.2s, duration: 00:02)
test 0003...[HTTP POST with auth and contents but with content-length set to 0]
--pd---e--- OK (3 out of 1250, remaining: 19:54, took 0.1s, duration: 00:02)
test 0004...[Replaced internal and added custom HTTP headers]
--pd---e--- OK (4 out of 1250, remaining: 16:12, took 0.2s, duration: 00:03)
test 0005...[HTTP over proxy]
--pd---e--- OK (5 out of 1250, remaining: 13:44, took 0.2s, duration: 00:03)
test 0006...[HTTP with simple cookie send]
--pd---e--- OK (6 out of 1250, remaining: 12:10, took 0.2s, duration: 00:03)
test 0007...[HTTP with cookie parser and header recording]
--pd--oe--- OK (7 out of 1250, remaining: 11:04, took 0.2s, duration: 00:03)
test 0008...[HTTP with cookie parsing from header file]
--pd---e--- OK (8 out of 1250, remaining: 10:26, took 0.3s, duration: 00:04)
test 0009...[HTTP RFC1867-type formposting]
--pd---e--- OK (9 out of 1250, remaining: 09:42, took 0.2s, duration: 00:04)
test 0010...[simple HTTP PUT from file]
--pd---e--- OK (10 out of 1250, remaining: 11:16, took 1.2s, duration: 00:05)
test 0011...[simple HTTP Location: following]
--pd---e--- OK (11 out of 1250, remaining: 10:45, took 0.3s, duration: 00:05)
test 0012...[HTTP range support]
--pd---e--- OK (12 out of 1250, remaining: 10:04, took 0.1s, duration: 00:05)
test 0013...[HTTP custom request 'DELETE']
--pd---e--- OK (13 out of 1250, remaining: 09:30, took 0.1s, duration: 00:05)
test 0014...[HTTP HEAD with Connection: close]
--pd---e--- OK (14 out of 1250, remaining: 09:00, took 0.1s, duration: 00:06)
test 0015...[--write-out test]
s-p----e--- OK (15 out of 1250, remaining: 08:35, took 0.1s, duration: 00:06)
test 0016...[HTTP with proxy authorization]
--pd---e--- OK (16 out of 1250, remaining: 08:14, took 0.1s, duration: 00:06)
test 0017...[HTTP with config file on stdin]
--pd---e--- OK (17 out of 1250, remaining: 07:55, took 0.1s, duration: 00:06)
test 0018...[multiple requests using {} in URL]
s-p----e--- OK (18 out of 1250, remaining: 07:40, took 0.2s, duration: 00:06)
test 0019...[attempt connect to non-listening socket]
-------e--- OK (19 out of 1250, remaining: 08:44, took 1.4s, duration: 00:08)
test 0020...[attempt connect to non-existing host name]
-------e--- OK (20 out of 1250, remaining: 08:32, took 0.2s, duration: 00:08)
test 0021...[use curl with multiple request methods]
-------e--- OK (21 out of 1250, remaining: 08:15, took 0.1s, duration: 00:08)
test 0022...[get HTTP with URL > 10000 bytes]
--pd---e--- OK (22 out of 1250, remaining: 08:01, took 0.1s, duration: 00:08)
test 0023...[unsupported protocol:// URL]
-------e--- OK (23 out of 1250, remaining: 07:47, took 0.1s, duration: 00:08)
test 0024...[HTTP GET fail silently on HTTP error return]
--p---oe--- OK (24 out of 1250, remaining: 07:35, took 0.1s, duration: 00:08)
test 0025...[looping HTTP Location: following with --max-redirs]
--pd---e--- OK (25 out of 1250, remaining: 07:24, took 0.2s, duration: 00:09)
test 0026...[specify more -o than URLs]
--pd---e--- OK (26 out of 1250, remaining: 07:17, took 0.2s, duration: 00:09)
test 0027...[Get same cookie page several times]
--pd---e--- OK (27 out of 1250, remaining: 07:16, took 0.3s, duration: 00:09)
test 0028...[HTTP Location: following with extra spaces in header]
--pd---e--- OK (28 out of 1250, remaining: 07:13, took 0.3s, duration: 00:09)
test 0029...[HTTP with 2 secs timeout]
Warning: server logs lock timeout (2 seconds) expired
--pd---e--- OK (29 out of 1250, remaining: 10:08, took 4.5s, duration: 00:14)
test 0030...[HTTP with no data in server reply]
--p----e--- OK (30 out of 1250, remaining: 13:50, took 6.0s, duration: 00:20)
test 0031...[HTTP with weirdly formatted cookies and cookiejar storage]
--pd--oe--- OK (31 out of 1250, remaining: 13:33, took 0.2s, duration: 00:20)
test 0032...[HTTP with -d and -G]
--pd---e--- OK (32 out of 1250, remaining: 13:12, took 0.1s, duration: 00:20)
test 0033...[HTTP PUT with resume]
--pd---e--- OK (33 out of 1250, remaining: 13:33, took 1.2s, duration: 00:22)
test 0034...[HTTP GET with chunked Transfer-Encoding]
--pd---e--- OK (34 out of 1250, remaining: 13:14, took 0.2s, duration: 00:22)
test 0035...[HTTP POST binary data with embedded NUL]
--pd---e--- OK (35 out of 1250, remaining: 12:58, took 0.2s, duration: 00:22)
test 0036...[HTTP GET with bad chunked Transfer-Encoding]
--pd---e--- OK (36 out of 1250, remaining: 12:41, took 0.1s, duration: 00:22)
test 0037...[HTTP GET with nothing returned from server]
--p----e--- OK (37 out of 1250, remaining: 12:27, took 0.2s, duration: 00:22)
test 0038...[HTTP resume request without server supporting it]
--p---oe--- OK (38 out of 1250, remaining: 12:11, took 0.2s, duration: 00:22)
test 0039...[HTTP RFC1867-type formposting with filename= and type=]
--pd---e--- OK (39 out of 1250, remaining: 12:29, took 1.2s, duration: 00:24)
test 0040...[HTTP redirect with whitespace after ? (and conversion)]
--pd---e--- OK (40 out of 1250, remaining: 12:18, took 0.3s, duration: 00:24)
test 0041...[HTTP formpost with missing file]
-------e--- OK (41 out of 1250, remaining: 12:04, took 0.2s, duration: 00:24)
test 0042...[HTTP redirect with whitespace in path (and conversion)]
--pd---e--- OK (42 out of 1250, remaining: 11:54, took 0.3s, duration: 00:24)
test 0043...[HTTP Location: following over HTTP proxy]
--pd---e--- OK (43 out of 1250, remaining: 11:45, took 0.3s, duration: 00:25)
test 0044...[HTTP RFC1867-type formposting without Expect: header]
--pd---e--- OK (44 out of 1250, remaining: 11:34, took 0.2s, duration: 00:25)
test 0045...[simple HTTP Location: without protocol in initial URL]
--pd---e--- OK (45 out of 1250, remaining: 11:25, took 0.3s, duration: 00:25)
test 0046...[HTTP with bad domain name, get cookies and store in cookie jar]
--pd--oe--- OK (46 out of 1250, remaining: 11:13, took 0.2s, duration: 00:25)
test 0047...[simple HTTP 1.0 GET]
--pd---e--- OK (47 out of 1250, remaining: 11:04, took 0.2s, duration: 00:25)
test 0048...[HTTP with -d and -G and -I]
--pd---e--- OK (48 out of 1250, remaining: 10:54, took 0.2s, duration: 00:26)
test 0049...[HTTP follow redirect with ../]
--pd---e--- OK (49 out of 1250, remaining: 10:47, took 0.3s, duration: 00:26)
test 0050...[HTTP follow redirect with ../../]
--pd---e--- OK (50 out of 1250, remaining: 10:40, took 0.3s, duration: 00:26)
test 0051...[HTTP follow redirect with excessive ../]
--pd---e--- OK (51 out of 1250, remaining: 10:33, took 0.3s, duration: 00:26)
test 0052...[HTTP follow redirect with ./-prefix]
--pd---e--- OK (52 out of 1250, remaining: 10:27, took 0.3s, duration: 00:27)
test 0053...[HTTP, junk session cookies]
--pd---e--- OK (53 out of 1250, remaining: 10:18, took 0.1s, duration: 00:27)
test 0054...[HTTP with blank Location:]
--pd---e--- OK (54 out of 1250, remaining: 10:11, took 0.2s, duration: 00:27)
test 0055...[HTTP follow redirect with single slash in path]
--pd---e--- OK (55 out of 1250, remaining: 10:05, took 0.3s, duration: 00:27)
test 0056...[HTTP POST with *HUGE* request and chunked transfer-encoding]
--pd---e--- OK (56 out of 1250, remaining: 09:59, took 0.2s, duration: 00:28)
test 0057...[HTTP content-type with spaces in]
s-p----e--- OK (57 out of 1250, remaining: 09:53, took 0.2s, duration: 00:28)
test 0058...[HTTP PUT from file with weird letters]
--pd---e--- OK (58 out of 1250, remaining: 10:11, took 1.4s, duration: 00:29)
test 0059...[HTTP URL with slash but with "parameter"]
--pd---e--- OK (59 out of 1250, remaining: 12:35, took 7.7s, duration: 00:37)
test 0060...[HTTP PUT from stdin with wrong content-length]
--pd---e--- OK (60 out of 1250, remaining: 13:11, took 2.5s, duration: 00:39)
test 0061...[HTTP with various cookies and custom Host:]
--pd--oe--- OK (61 out of 1250, remaining: 13:00, took 0.1s, duration: 00:40)
test 0062...[HTTP, send cookies when using custom Host:]
--pd---e--- OK (62 out of 1250, remaining: 12:51, took 0.2s, duration: 00:40)
test 0063...[HTTP with proxy authorization set in environment]
--pd---e--- OK (63 out of 1250, remaining: 12:42, took 0.2s, duration: 00:40)
test 0064 SKIPPED: curl has SSPI support
test 0065 SKIPPED: curl has SSPI support
test 0066...[HTTP GET without headers in the response]
--pd---e--- OK (66 out of 1250, remaining: 12:09, took 0.2s, duration: 00:40)
test 0067 SKIPPED: curl has SSPI support
test 0071...[HTTP and -F upload in config file]
--pd---e--- OK (71 out of 1250, remaining: 11:19, took 0.3s, duration: 00:40)
test 0073...[HTTP, receive cookies when using custom Host:, domain using only two dots]
--pd--oe--- OK (73 out of 1250, remaining: 11:03, took 0.2s, duration: 00:41)
test 0074...[HTTP, urlglob {}-retrieval and -o #[num] usage]
--p---oe--- OK (74 out of 1250, remaining: 10:57, took 0.2s, duration: 00:41)
test 0075...[HTTP, urlglob retrieval with bad range]
s------e--- OK (75 out of 1250, remaining: 10:51, took 0.2s, duration: 00:41)
test 0076...[HTTP, -O with no file name part in the URL]
-------e--- OK (76 out of 1250, remaining: 10:44, took 0.1s, duration: 00:41)
test 0077...[HTTP with -z "older date"]
--pd---e--- OK (77 out of 1250, remaining: 10:38, took 0.1s, duration: 00:41)
test 0078...[HTTP with -z "newer date"]
--pd---e--- OK (78 out of 1250, remaining: 10:31, took 0.2s, duration: 00:42)
test 0079...[FTP over HTTP proxy]
--pd---e--- OK (79 out of 1250, remaining: 10:26, took 0.2s, duration: 00:42)
RUN: server/sws --pidfile ".http2_server.pid" --logfile "log/http2_server.log" --connect 127.0.0.1 --ipv4 --port 9013 --srcdir "/tests"
test 0080...[HTTP 1.0 CONNECT with proxytunnel and proxy+host Basic authentication]
--pd-P-e--- OK (80 out of 1250, remaining: 11:02, took 3.1s, duration: 00:45)
test 0082...[HTTP with proxy requiring NTLM, but we send Basic]
--pd---e--- OK (82 out of 1250, remaining: 10:47, took 0.2s, duration: 00:45)
test 0083...[HTTP over proxy-tunnel with site authentication]
--pd-P-e--- OK (83 out of 1250, remaining: 10:51, took 0.9s, duration: 00:46)
test 0084...[HTTP over proxy with site authentication]
--pd---e--- OK (84 out of 1250, remaining: 10:45, took 0.2s, duration: 00:46)
test 0085...[HTTP over proxy with site and proxy authentication]
--pd---e--- OK (85 out of 1250, remaining: 10:40, took 0.2s, duration: 00:46)
test 0086...[HTTP, urlglob []-retrieval and -o #[num] usage]
--p---oe--- OK (86 out of 1250, remaining: 10:37, took 0.3s, duration: 00:47)
test 0087...[urlglob with out of range -o #[num] usage]
------oe--- OK (87 out of 1250, remaining: 10:31, took 0.1s, duration: 00:47)
test 0092...[HTTP resume transfer with the whole file already downloaded]
--pd---e--- OK (92 out of 1250, remaining: 09:56, took 0.1s, duration: 00:47)
test 0093...[HTTP GET with failed proxy auth]
--pd---e--- OK (93 out of 1250, remaining: 09:51, took 0.2s, duration: 00:47)
test 0094...[HTTPS GET with failed proxy auth (CONNECT 1.0)]
--p----e--- OK (94 out of 1250, remaining: 09:46, took 0.1s, duration: 00:47)
test 0095...[HTTP over proxytunnel using POST]
--pd-P-e--- OK (95 out of 1250, remaining: 09:48, took 0.7s, duration: 00:48)
test 0096 SKIPPED: curl lacks TrackMemory support
test 0097...[HTTP POST with custom content-type]
--pd---e--- OK (97 out of 1250, remaining: 09:37, took 0.1s, duration: 00:48)
test 0098...[HTTP PUT from stdin with set size, disabling chunked transfer-encoding]
--pd---e--- OK (98 out of 1250, remaining: 09:44, took 1.2s, duration: 00:49)
test 0099...[HTTP GET with large-file resume point and failed resume]
--pd---e--- OK (99 out of 1250, remaining: 09:40, took 0.2s, duration: 00:49)
./server/sockfilt --ipv4 --port 8992 --pidfile "./.ftp_sockctrl.pid" --logfile "./log/ftp_sockctrl.log"
OUT: 220- _ _ ____ _
220- ___| | | | _ \| |
220- / __| | | | |_) | |
220- | (__| |_| | _ {| |___
220 \___|\___/|_| \_\_____|
IN: USER anonymous
IN: PASS ftp@example.com
IN: PWD
IN: EPSV
./server/sockfilt --ipv4 --port 0 --pidfile "./.ftp_sockdata.pid" --logfile "./log/ftp_sockdata.log"
IN: TYPE I
IN: SIZE verifiedserver
IN: RETR verifiedserver
FTPD: We returned proof we are the test server
IN: QUIT
test 0100...[FTP dir list PASV]
OUT: 220- _ _ ____ _
220- ___| | | | _ \| |
220- / __| | | | |_) | |
220- | (__| |_| | _ {| |___
220 \___|\___/|_| \_\_____|
IN: USER anonymous
IN: PASS ftp@example.com
IN: PWD
IN: CWD test-100
IN: EPSV
./server/sockfilt --ipv4 --port 0 --pidfile "./.ftp_sockdata.pid" --logfile "./log/ftp_sockdata.log"
IN: TYPE A
IN: LIST
IN: QUIT
--pd---e--- OK (100 out of 1250, remaining: 10:05, took 2.8s, duration: 00:52)
test 0101...[FTP dir list, PORT with specified IP]
OUT: 220- _ _ ____ _
220- ___| | | | _ \| |
220- / __| | | | |_) | |
220- | (__| |_| | _ {| |___
220 \___|\___/|_| \_\_____|
IN: USER anonymous
IN: PASS ftp@example.com
IN: PWD
IN: EPRT |1|127.0.0.1|61715|
./server/sockfilt --ipv4 --connect 61715 --addr "127.0.0.1" --pidfile "./.ftp_sockdata.pid" --logfile "./log/ftp_sockdata.log"
IN: TYPE A
IN: LIST
IN: QUIT
--pd---e--- OK (101 out of 1250, remaining: 10:03, took 0.3s, duration: 00:53)
test 0102...[FTP RETR PASV]
OUT: 220- _ _ ____ _
220- ___| | | | _ \| |
220- / __| | | | |_) | |
220- | (__| |_| | _ {| |___
220 \___|\___/|_| \_\_____|
IN: USER anonymous
IN: PASS ftp@example.com
IN: PWD
IN: EPSV
IN: PASV
./server/sockfilt --ipv4 --port 0 --pidfile "./.ftp_sockdata.pid" --logfile "./log/ftp_sockdata.log"
IN: TYPE I
IN: SIZE 102
IN: RETR 102
IN: QUIT
--pd---e--- OK (102 out of 1250, remaining: 10:00, took 0.3s, duration: 00:53)
test 0103...[FTP RETR PORT with CWD]
OUT: 220- _ _ ____ _
220- ___| | | | _ \| |
220- / __| | | | |_) | |
220- | (__| |_| | _ {| |___
220 \___|\___/|_| \_\_____|
IN: USER anonymous
IN: PASS ftp@example.com
IN: PWD
IN: CWD a
IN: CWD path
IN: EPRT |1|127.0.0.1|61721|
./server/sockfilt --ipv4 --connect 61721 --addr "127.0.0.1" --pidfile "./.ftp_sockdata.pid" --logfile "./log/ftp_sockdata.log"
IN: TYPE I
IN: SIZE 103
IN: RETR 103
IN: QUIT
--pd---e--- OK (103 out of 1250, remaining: 09:57, took 0.3s, duration: 00:53)
test 0104...[FTP --head to get file size only]
OUT: 220- _ _ ____ _
220- ___| | | | _ \| |
220- / __| | | | |_) | |
220- | (__| |_| | _ {| |___
220 \___|\___/|_| \_\_____|
IN: USER anonymous
IN: PASS ftp@example.com
IN: PWD
IN: CWD a
IN: CWD path
IN: MDTM 104
IN: TYPE I
IN: SIZE 104
IN: REST 0
IN: QUIT
--p----e--- OK (104 out of 1250, remaining: 09:53, took 0.1s, duration: 00:53)
test 0105...[FTP user+password in URL and ASCII transfer]
OUT: 220- _ _ ____ _
220- ___| | | | _ \| |
220- / __| | | | |_) | |
220- | (__| |_| | _ {| |___
220 \___|\___/|_| \_\_____|
IN: USER userdude
IN: PASS passfellow
IN: PWD
IN: EPSV
IN: PASV
./server/sockfilt --ipv4 --port 0 --pidfile "./.ftp_sockdata.pid" --logfile "./log/ftp_sockdata.log"
IN: TYPE A
IN: SIZE 105
IN: RETR 105
IN: QUIT
--pd---e--- OK (105 out of 1250, remaining: 09:50, took 0.3s, duration: 00:54)
test 0106...[FTP GET with type=A style ASCII URL using %20 codes]
OUT: 220- _ _ ____ _
220- ___| | | | _ \| |
220- / __| | | | |_) | |
220- | (__| |_| | _ {| |___
220 \___|\___/|_| \_\_____|
IN: USER anonymous
IN: PASS ftp@example.com
IN: PWD
IN: CWD /
IN: CWD path with spaces
IN: CWD and things2
IN: EPSV
./server/sockfilt --ipv4 --port 0 --pidfile "./.ftp_sockdata.pid" --logfile "./log/ftp_sockdata.log"
IN: TYPE A
IN: SIZE 106
IN: RETR 106
IN: QUIT
--pd---e--- OK (106 out of 1250, remaining: 09:48, took 0.3s, duration: 00:54)
test 0107...[FTP PASV upload file]
OUT: 220- _ _ ____ _
220- ___| | | | _ \| |
220- / __| | | | |_) | |
220- | (__| |_| | _ {| |___
220 \___|\___/|_| \_\_____|
IN: USER anonymous
IN: PASS ftp@example.com
IN: PWD
IN: EPSV
./server/sockfilt --ipv4 --port 0 --pidfile "./.ftp_sockdata.pid" --logfile "./log/ftp_sockdata.log"
IN: TYPE I
IN: STOR 107
IN: QUIT
--p-u--e--- OK (107 out of 1250, remaining: 09:46, took 0.4s, duration: 00:54)
test 0108...[FTP PORT upload with CWD]
OUT: 220- _ _ ____ _
220- ___| | | | _ \| |
220- / __| | | | |_) | |
220- | (__| |_| | _ {| |___
220 \___|\___/|_| \_\_____|
IN: USER anonymous
IN: PASS ftp@example.com
IN: PWD
IN: CWD CWD
IN: CWD STOR
IN: CWD RETR
IN: EPRT |1|127.0.0.1|61734|
./server/sockfilt --ipv4 --connect 61734 --addr "127.0.0.1" --pidfile "./.ftp_sockdata.pid" --logfile "./log/ftp_sockdata.log"
IN: TYPE I
IN: STOR 108
IN: QUIT
--p-u--e--- OK (108 out of 1250, remaining: 09:43, took 0.3s, duration: 00:55)
test 0109...[FTP PASV upload append]
OUT: 220- _ _ ____ _
220- ___| | | | _ \| |
220- / __| | | | |_) | |
220- | (__| |_| | _ {| |___
220 \___|\___/|_| \_\_____|
IN: USER anonymous
IN: PASS ftp@example.com
IN: PWD
IN: EPSV
./server/sockfilt --ipv4 --port 0 --pidfile "./.ftp_sockdata.pid" --logfile "./log/ftp_sockdata.log"
IN: TYPE I
IN: APPE 109
IN: QUIT
--p-u--e--- OK (109 out of 1250, remaining: 09:41, took 0.3s, duration: 00:55)
test 0110...[FTP download resume with set limit]
OUT: 220- _ _ ____ _
220- ___| | | | _ \| |
220- / __| | | | |_) | |
220- | (__| |_| | _ {| |___
220 \___|\___/|_| \_\_____|
IN: USER anonymous
IN: PASS ftp@example.com
IN: PWD
IN: EPSV
IN: PASV
./server/sockfilt --ipv4 --port 0 --pidfile "./.ftp_sockdata.pid" --logfile "./log/ftp_sockdata.log"
IN: TYPE I
IN: SIZE 110
IN: REST 20
IN: RETR 110
IN: QUIT
--pd---e--- OK (110 out of 1250, remaining: 09:39, took 0.4s, duration: 00:55)
test 0111...[FTP download resume beyond file size]
OUT: 220- _ _ ____ _
220- ___| | | | _ \| |
220- / __| | | | |_) | |
220- | (__| |_| | _ {| |___
220 \___|\___/|_| \_\_____|
IN: USER anonymous
IN: PASS ftp@example.com
IN: PWD
IN: EPSV
./server/sockfilt --ipv4 --port 0 --pidfile "./.ftp_sockdata.pid" --logfile "./log/ftp_sockdata.log"
IN: TYPE I
IN: SIZE 111
IN: QUIT
--p----e--- OK (111 out of 1250, remaining: 09:36, took 0.2s, duration: 00:56)
test 0112...[FTP PASV upload resume]
* kill pid for ftp-data => 12596
OUT: 220- _ _ ____ _
220- ___| | | | _ \| |
220- / __| | | | |_) | |
220- | (__| |_| | _ {| |___
220 \___|\___/|_| \_\_____|
IN: USER anonymous
IN: PASS ftp@example.com
IN: PWD
IN: EPSV
./server/sockfilt --ipv4 --port 0 --pidfile "./.ftp_sockdata.pid" --logfile "./log/ftp_sockdata.log"
IN: TYPE I
IN: APPE 112
IN: QUIT
--p-u--e--- OK (112 out of 1250, remaining: 09:37, took 0.7s, duration: 00:56)
test 0113...[FTP download, failed login: USER not valid]
OUT: 220- _ _ ____ _
220- ___| | | | _ \| |
220- / __| | | | |_) | |
220- | (__| |_| | _ {| |___
220 \___|\___/|_| \_\_____|
IN: USER anonymous
--p----e--- OK (113 out of 1250, remaining: 09:33, took 0.1s, duration: 00:56)
test 0114...[FTP download, failed login: PASS not valid]
OUT: 220- _ _ ____ _
220- ___| | | | _ \| |
220- / __| | | | |_) | |
220- | (__| |_| | _ {| |___
220 \___|\___/|_| \_\_____|
IN: USER anonymous
IN: PASS ftp@example.com
--p----e--- OK (114 out of 1250, remaining: 09:28, took 0.1s, duration: 00:57)
test 0115...[FTP download, failed PASV]
OUT: 220- _ _ ____ _
220- ___| | | | _ \| |
220- / __| | | | |_) | |
220- | (__| |_| | _ {| |___
220 \___|\___/|_| \_\_____|
IN: USER anonymous
IN: PASS ftp@example.com
IN: PWD
IN: EPSV
IN: PASV
IN: QUIT
--p----e--- OK (115 out of 1250, remaining: 09:24, took 0.1s, duration: 00:57)
test 0116...[FTP download, failed PORT]
OUT: 220- _ _ ____ _
220- ___| | | | _ \| |
220- / __| | | | |_) | |
220- | (__| |_| | _ {| |___
220 \___|\___/|_| \_\_____|
IN: USER anonymous
IN: PASS ftp@example.com
IN: PWD
IN: EPRT |1|1.2.3.4|61752|
IN: PORT 1,2,3,4,241,57
IN: QUIT
--p----e--- OK (116 out of 1250, remaining: 09:21, took 0.1s, duration: 00:57)
test 0117...[FTP download, failed TYPE]
OUT: 220- _ _ ____ _
220- ___| | | | _ \| |
220- / __| | | | |_) | |
220- | (__| |_| | _ {| |___
220 \___|\___/|_| \_\_____|
IN: USER anonymous
IN: PASS ftp@example.com
IN: PWD
IN: EPSV
IN: PASV
./server/sockfilt --ipv4 --port 0 --pidfile "./.ftp_sockdata.pid" --logfile "./log/ftp_sockdata.log"
IN: TYPE I
IN: QUIT
--p----e--- OK (117 out of 1250, remaining: 09:17, took 0.2s, duration: 00:57)
test 0118...[FTP download, failed RETR]
* kill pid for ftp-data => 5608
OUT: 220- _ _ ____ _
220- ___| | | | _ \| |
220- / __| | | | |_) | |
220- | (__| |_| | _ {| |___
220 \___|\___/|_| \_\_____|
IN: USER anonymous
IN: PASS ftp@example.com
IN: PWD
IN: EPSV
IN: PASV
./server/sockfilt --ipv4 --port 0 --pidfile "./.ftp_sockdata.pid" --logfile "./log/ftp_sockdata.log"
IN: TYPE I
IN: SIZE 118
IN: RETR 118
IN: QUIT
--p----e--- OK (118 out of 1250, remaining: 09:17, took 0.5s, duration: 00:58)
test 0119...[FTP download, failed RETR with PORT]
* kill pid for ftp-data => 6780
OUT: 220- _ _ ____ _
220- ___| | | | _ \| |
220- / __| | | | |_) | |
220- | (__| |_| | _ {| |___
220 \___|\___/|_| \_\_____|
IN: USER anonymous
IN: PASS ftp@example.com
IN: PWD
IN: EPRT |1|127.0.0.1|61761|
./server/sockfilt --ipv4 --connect 61761 --addr "127.0.0.1" --pidfile "./.ftp_sockdata.pid" --logfile "./log/ftp_sockdata.log"
IN: TYPE I
IN: SIZE 119
IN: RETR 119
IN: QUIT
--p----e--- OK (119 out of 1250, remaining: 09:17, took 0.5s, duration: 00:58)
test 0120...[ftp download with post-quote delete operation]
* kill pid for ftp-data => 2720
OUT: 220- _ _ ____ _
220- ___| | | | _ \| |
220- / __| | | | |_) | |
220- | (__| |_| | _ {| |___
220 \___|\___/|_| \_\_____|
IN: USER anonymous
IN: PASS ftp@example.com
IN: PWD
IN: EPSV
IN: PASV
./server/sockfilt --ipv4 --port 0 --pidfile "./.ftp_sockdata.pid" --logfile "./log/ftp_sockdata.log"
IN: TYPE I
IN: SIZE 120
IN: RETR 120
IN: DELE file
IN: QUIT
--pd---e--- OK (120 out of 1250, remaining: 09:18, took 0.7s, duration: 00:59)
test 0121...[ftp download with post- and pre-transfer delete operations]
OUT: 220- _ _ ____ _
220- ___| | | | _ \| |
220- / __| | | | |_) | |
220- | (__| |_| | _ {| |___
220 \___|\___/|_| \_\_____|
IN: USER anonymous
IN: PASS ftp@example.com
IN: PWD
IN: DELE before_transfer
IN: EPSV
./server/sockfilt --ipv4 --port 0 --pidfile "./.ftp_sockdata.pid" --logfile "./log/ftp_sockdata.log"
IN: TYPE I
IN: SIZE 121
IN: RETR 121
IN: DELE after_transfer
IN: QUIT
--pd---e--- OK (121 out of 1250, remaining: 09:16, took 0.3s, duration: 00:59)
test 0122...[FTP download resume with whole file already downloaded]
OUT: 220- _ _ ____ _
220- ___| | | | _ \| |
220- / __| | | | |_) | |
220- | (__| |_| | _ {| |___
220 \___|\___/|_| \_\_____|
IN: USER anonymous
IN: PASS ftp@example.com
IN: PWD
IN: EPSV
IN: PASV
./server/sockfilt --ipv4 --port 0 --pidfile "./.ftp_sockdata.pid" --logfile "./log/ftp_sockdata.log"
IN: TYPE I
IN: SIZE 122
IN: QUIT
--p----e--- OK (122 out of 1250, remaining: 09:14, took 0.2s, duration: 00:59)
test 0123...[FTP upload resume with whole file already downloaded]
* kill pid for ftp-data => 12340
OUT: 220- _ _ ____ _
220- ___| | | | _ \| |
220- / __| | | | |_) | |
220- | (__| |_| | _ {| |___
220 \___|\___/|_| \_\_____|
IN: USER anonymous
IN: PASS ftp@example.com
IN: PWD
IN: EPSV
./server/sockfilt --ipv4 --port 0 --pidfile "./.ftp_sockdata.pid" --logfile "./log/ftp_sockdata.log"
IN: TYPE I
IN: QUIT
--p----e--- OK (123 out of 1250, remaining: 09:13, took 0.5s, duration: 01:00)
test 0124...[FTP download, failed PWD]
* kill pid for ftp-data => 1132
OUT: 220- _ _ ____ _
220- ___| | | | _ \| |
220- / __| | | | |_) | |
220- | (__| |_| | _ {| |___
220 \___|\___/|_| \_\_____|
IN: USER anonymous
IN: PASS ftp@example.com
IN: PWD
IN: EPSV
IN: PASV
./server/sockfilt --ipv4 --port 0 --pidfile "./.ftp_sockdata.pid" --logfile "./log/ftp_sockdata.log"
IN: TYPE I
IN: SIZE 124
IN: RETR 124
IN: QUIT
--pd---e--- OK (124 out of 1250, remaining: 09:14, took 0.6s, duration: 01:01)
test 0125...[FTP download, failed CWD]
OUT: 220- _ _ ____ _
220- ___| | | | _ \| |
220- / __| | | | |_) | |
220- | (__| |_| | _ {| |___
220 \___|\___/|_| \_\_____|
IN: USER anonymous
IN: PASS ftp@example.com
IN: PWD
IN: CWD path
IN: QUIT
--p----e--- OK (125 out of 1250, remaining: 09:10, took 0.1s, duration: 01:01)
test 0126...[FTP download with multiple replies at once in RETR]
OUT: 220- _ _ ____ _
220- ___| | | | _ \| |
220- / __| | | | |_) | |
220- | (__| |_| | _ {| |___
220 \___|\___/|_| \_\_____|
IN: USER anonymous
IN: PASS ftp@example.com
IN: PWD
IN: CWD blalbla
IN: CWD lululul
IN: EPSV
./server/sockfilt --ipv4 --port 0 --pidfile "./.ftp_sockdata.pid" --logfile "./log/ftp_sockdata.log"
IN: TYPE I
IN: SIZE 126
IN: RETR 126
IN: QUIT
--pd---e--- OK (126 out of 1250, remaining: 09:08, took 0.3s, duration: 01:01)
test 0127...[FTP --disable-epsv]
OUT: 220- _ _ ____ _
220- ___| | | | _ \| |
220- / __| | | | |_) | |
220- | (__| |_| | _ {| |___
220 \___|\___/|_| \_\_____|
IN: USER anonymous
IN: PASS ftp@example.com
IN: PWD
IN: CWD path
IN: CWD to
IN: CWD file
IN: PASV
./server/sockfilt --ipv4 --port 0 --pidfile "./.ftp_sockdata.pid" --logfile "./log/ftp_sockdata.log"
IN: TYPE I
IN: SIZE 127
IN: RETR 127
IN: QUIT
--pd---e--- OK (127 out of 1250, remaining: 09:07, took 0.4s, duration: 01:01)
test 0128...[FTP upload with --crlf]
OUT: 220- _ _ ____ _
220- ___| | | | _ \| |
220- / __| | | | |_) | |
220- | (__| |_| | _ {| |___
220 \___|\___/|_| \_\_____|
IN: USER anonymous
IN: PASS ftp@example.com
IN: PWD
IN: EPSV
./server/sockfilt --ipv4 --port 0 --pidfile "./.ftp_sockdata.pid" --logfile "./log/ftp_sockdata.log"
IN: TYPE I
IN: STOR 128
IN: QUIT
--p-u--e--- OK (128 out of 1250, remaining: 09:05, took 0.4s, duration: 01:02)
test 0129...[FTP GET with type=A style ASCII URL and understated server SIZE]
OUT: 220- _ _ ____ _
220- ___| | | | _ \| |
220- / __| | | | |_) | |
220- | (__| |_| | _ {| |___
220 \___|\___/|_| \_\_____|
IN: USER anonymous
IN: PASS ftp@example.com
IN: PWD
IN: EPSV
./server/sockfilt --ipv4 --port 0 --pidfile "./.ftp_sockdata.pid" --logfile "./log/ftp_sockdata.log"
IN: TYPE A
IN: SIZE 129
IN: RETR 129
IN: QUIT
--pd---e--- OK (129 out of 1250, remaining: 09:04, took 0.4s, duration: 01:02)
test 0130...[FTP (optional .netrc; no user/pass) dir list PASV]
OUT: 220- _ _ ____ _
220- ___| | | | _ \| |
220- / __| | | | |_) | |
220- | (__| |_| | _ {| |___
220 \___|\___/|_| \_\_____|
IN: USER user1
IN: PASS passwd1
IN: PWD
IN: EPSV
./server/sockfilt --ipv4 --port 0 --pidfile "./.ftp_sockdata.pid" --logfile "./log/ftp_sockdata.log"
IN: TYPE A
IN: LIST
IN: QUIT
--pd---e--- OK (130 out of 1250, remaining: 09:02, took 0.3s, duration: 01:02)
test 0131...[FTP (optional .netrc; user/no pass) dir list PASV]
OUT: 220- _ _ ____ _
220- ___| | | | _ \| |
220- / __| | | | |_) | |
220- | (__| |_| | _ {| |___
220 \___|\___/|_| \_\_____|
IN: USER user2
IN: PASS passwd2
IN: PWD
IN: EPSV
./server/sockfilt --ipv4 --port 0 --pidfile "./.ftp_sockdata.pid" --logfile "./log/ftp_sockdata.log"
IN: TYPE A
IN: LIST
IN: QUIT
--pd---e--- OK (131 out of 1250, remaining: 09:00, took 0.3s, duration: 01:03)
test 0132...[FTP (optional .netrc; user/passwd supplied) dir list PASV]
OUT: 220- _ _ ____ _
220- ___| | | | _ \| |
220- / __| | | | |_) | |
220- | (__| |_| | _ {| |___
220 \___|\___/|_| \_\_____|
IN: USER mary
IN: PASS mark
IN: PWD
IN: EPSV
./server/sockfilt --ipv4 --port 0 --pidfile "./.ftp_sockdata.pid" --logfile "./log/ftp_sockdata.log"
IN: TYPE A
IN: LIST
IN: QUIT
--pd---e--- OK (132 out of 1250, remaining: 08:59, took 0.3s, duration: 01:03)
test 0133...[FTP (compulsory .netrc; ignored user/passwd) dir list PASV]
OUT: 220- _ _ ____ _
220- ___| | | | _ \| |
220- / __| | | | |_) | |
220- | (__| |_| | _ {| |___
220 \___|\___/|_| \_\_____|
IN: USER user1
IN: PASS passwd1
IN: PWD
IN: EPSV
./server/sockfilt --ipv4 --port 0 --pidfile "./.ftp_sockdata.pid" --logfile "./log/ftp_sockdata.log"
IN: TYPE A
IN: LIST
IN: QUIT
--pd---e--- OK (133 out of 1250, remaining: 08:57, took 0.3s, duration: 01:03)
test 0134...[FTP (optional .netrc; programmatic user/passwd) dir list PASV]
OUT: 220- _ _ ____ _
220- ___| | | | _ \| |
220- / __| | | | |_) | |
220- | (__| |_| | _ {| |___
220 \___|\___/|_| \_\_____|
IN: USER romulus
IN: PASS rhemus
IN: PWD
IN: EPSV
./server/sockfilt --ipv4 --port 0 --pidfile "./.ftp_sockdata.pid" --logfile "./log/ftp_sockdata.log"
IN: TYPE A
IN: LIST
IN: QUIT
--pd---e--- OK (134 out of 1250, remaining: 08:55, took 0.3s, duration: 01:04)
test 0135...[FTP retrieve a byte-range]
OUT: 220- _ _ ____ _
220- ___| | | | _ \| |
220- / __| | | | |_) | |
220- | (__| |_| | _ {| |___
220 \___|\___/|_| \_\_____|
IN: USER anonymous
IN: PASS ftp@example.com
IN: PWD
IN: EPSV
./server/sockfilt --ipv4 --port 0 --pidfile "./.ftp_sockdata.pid" --logfile "./log/ftp_sockdata.log"
IN: TYPE I
IN: SIZE 135
IN: REST 4
IN: RETR 135
IN: ABOR
IN: QUIT
--pd---e--- OK (135 out of 1250, remaining: 08:54, took 0.4s, duration: 01:04)
test 0136...[FTP with user and no password]
OUT: 220- _ _ ____ _
220- ___| | | | _ \| |
220- / __| | | | |_) | |
220- | (__| |_| | _ {| |___
220 \___|\___/|_| \_\_____|
IN: USER user
IN: PASS
IN: PWD
IN: EPSV
./server/sockfilt --ipv4 --port 0 --pidfile "./.ftp_sockdata.pid" --logfile "./log/ftp_sockdata.log"
IN: TYPE I
IN: SIZE 136
IN: RETR 136
IN: QUIT
--pd---e--- OK (136 out of 1250, remaining: 08:53, took 0.4s, duration: 01:05)
test 0137...[FTP download without size in RETR string]
OUT: 220- _ _ ____ _
220- ___| | | | _ \| |
220- / __| | | | |_) | |
220- | (__| |_| | _ {| |___
220 \___|\___/|_| \_\_____|
IN: USER anonymous
IN: PASS ftp@example.com
IN: PWD
IN: CWD blalbla
IN: CWD lululul
IN: EPSV
./server/sockfilt --ipv4 --port 0 --pidfile "./.ftp_sockdata.pid" --logfile "./log/ftp_sockdata.log"
IN: TYPE I
IN: SIZE 137
IN: RETR 137
IN: QUIT
--pd---e--- OK (137 out of 1250, remaining: 08:51, took 0.3s, duration: 01:05)
test 0138...[FTP download without size in RETR string and no SIZE command]
OUT: 220- _ _ ____ _
220- ___| | | | _ \| |
220- / __| | | | |_) | |
220- | (__| |_| | _ {| |___
220 \___|\___/|_| \_\_____|
IN: USER anonymous
IN: PASS ftp@example.com
IN: PWD
IN: CWD blalbla
IN: CWD lululul
IN: EPSV
./server/sockfilt --ipv4 --port 0 --pidfile "./.ftp_sockdata.pid" --logfile "./log/ftp_sockdata.log"
IN: TYPE I
IN: SIZE 138
IN: RETR 138
IN: QUIT
--pd---e--- OK (138 out of 1250, remaining: 08:49, took 0.3s, duration: 01:05)
test 0139...[FTP download a newer file with -z]
OUT: 220- _ _ ____ _
220- ___| | | | _ \| |
220- / __| | | | |_) | |
220- | (__| |_| | _ {| |___
220 \___|\___/|_| \_\_____|
IN: USER anonymous
IN: PASS ftp@example.com
IN: PWD
IN: CWD blalbla
IN: MDTM 139
IN: EPSV
./server/sockfilt --ipv4 --port 0 --pidfile "./.ftp_sockdata.pid" --logfile "./log/ftp_sockdata.log"
IN: TYPE I
IN: SIZE 139
IN: RETR 139
IN: QUIT
--pd---e--- OK (139 out of 1250, remaining: 08:48, took 0.3s, duration: 01:06)
test 0140...[FTP download file with -z, expected to not transfer]
OUT: 220- _ _ ____ _
220- ___| | | | _ \| |
220- / __| | | | |_) | |
220- | (__| |_| | _ {| |___
220 \___|\___/|_| \_\_____|
IN: USER anonymous
IN: PASS ftp@example.com
IN: PWD
IN: CWD blalbla
IN: MDTM 140
IN: QUIT
--p----e--- OK (140 out of 1250, remaining: 08:45, took 0.1s, duration: 01:06)
test 0141...[FTP download info with -I]
OUT: 220- _ _ ____ _
220- ___| | | | _ \| |
220- / __| | | | |_) | |
220- | (__| |_| | _ {| |___
220 \___|\___/|_| \_\_____|
IN: USER anonymous
IN: PASS ftp@example.com
IN: PWD
IN: CWD blalbla
IN: MDTM 141
IN: TYPE I
IN: SIZE 141
IN: REST 0
IN: QUIT
s-p----e--- OK (141 out of 1250, remaining: 08:42, took 0.1s, duration: 01:06)
test 0142...[FTP URL with 150 dir levels]
OUT: 220- _ _ ____ _
220- ___| | | | _ \| |
220- / __| | | | |_) | |
220- | (__| |_| | _ {| |___
220 \___|\___/|_| \_\_____|
IN: USER anonymous
IN: PASS ftp@example.com
IN: PWD
IN: CWD part1
IN: CWD part2
IN: CWD part3
IN: CWD part4
IN: CWD part5
IN: CWD part6
IN: CWD part7
IN: CWD part8
IN: CWD part9
IN: CWD part10
IN: CWD part11
IN: CWD part12
IN: CWD part13
IN: CWD part14
IN: CWD part15
IN: CWD part16
IN: CWD part17
IN: CWD part18
IN: CWD part19
IN: CWD part20
IN: CWD part21
IN: CWD part22
IN: CWD part23
IN: CWD part24
IN: CWD part25
IN: CWD part26
IN: CWD part27
IN: CWD part28
IN: CWD part29
IN: CWD part30
IN: CWD part31
IN: CWD part32
IN: CWD part33
IN: CWD part34
IN: CWD part35
IN: CWD part36
IN: CWD part37
IN: CWD part38
IN: CWD part39
IN: CWD part40
IN: CWD part41
IN: CWD part42
IN: CWD part43
IN: CWD part44
IN: CWD part45
IN: CWD part46
IN: CWD part47
IN: CWD part48
IN: CWD part49
IN: CWD part50
IN: CWD part51
IN: CWD part52
IN: CWD part53
IN: CWD part54
IN: CWD part55
IN: CWD part56
IN: CWD part57
IN: CWD part58
IN: CWD part59
IN: CWD part60
IN: CWD part61
IN: CWD part62
IN: CWD part63
IN: CWD part64
IN: CWD part65
IN: CWD part66
IN: CWD part67
IN: CWD part68
IN: CWD part69
IN: CWD part70
IN: CWD part71
IN: CWD part72
IN: CWD part73
IN: CWD part74
IN: CWD part75
IN: CWD part76
IN: CWD part77
IN: CWD part78
IN: CWD part79
IN: CWD part80
IN: CWD part81
IN: CWD part82
IN: CWD part83
IN: CWD part84
IN: CWD part85
IN: CWD part86
IN: CWD part87
IN: CWD part88
IN: CWD part89
IN: CWD part90
IN: CWD part91
IN: CWD part92
IN: CWD part93
IN: CWD part94
IN: CWD part95
IN: CWD part96
IN: CWD part97
IN: CWD part98
IN: CWD part99
IN: CWD part100
IN: CWD part101
IN: CWD part102
IN: CWD part103
IN: CWD part104
IN: CWD part105
IN: CWD part106
IN: CWD part107
IN: CWD part108
IN: CWD part109
IN: CWD part110
IN: CWD part111
IN: CWD part112
IN: CWD part113
IN: CWD part114
IN: CWD part115
IN: CWD part116
IN: CWD part117
IN: CWD part118
IN: CWD part119
IN: CWD part120
IN: CWD part121
IN: CWD part122
IN: CWD part123
IN: CWD part124
IN: CWD part125
IN: CWD part126
IN: CWD part127
IN: CWD part128
IN: CWD part129
IN: CWD part130
IN: CWD part131
IN: CWD part132
IN: CWD part133
IN: CWD part134
IN: CWD part135
IN: CWD part136
IN: CWD part137
IN: CWD part138
IN: CWD part139
IN: CWD part140
IN: CWD part141
IN: CWD part142
IN: CWD part143
IN: CWD part144
IN: CWD part145
IN: CWD part146
IN: CWD part147
IN: CWD part148
IN: CWD part149
IN: CWD part150
IN: EPSV
./server/sockfilt --ipv4 --port 0 --pidfile "./.ftp_sockdata.pid" --logfile "./log/ftp_sockdata.log"
IN: TYPE I
IN: SIZE 142
IN: RETR 142
IN: QUIT
--pd---e--- OK (142 out of 1250, remaining: 08:42, took 0.6s, duration: 01:06)
test 0143...[FTP URL with type=a]
OUT: 220- _ _ ____ _
220- ___| | | | _ \| |
220- / __| | | | |_) | |
220- | (__| |_| | _ {| |___
220 \___|\___/|_| \_\_____|
IN: USER anonymous
IN: PASS ftp@example.com
IN: PWD
IN: CWD /tmp
IN: CWD moo
IN: EPSV
./server/sockfilt --ipv4 --port 0 --pidfile "./.ftp_sockdata.pid" --logfile "./log/ftp_sockdata.log"
IN: TYPE A
IN: SIZE 143
IN: RETR 143
IN: QUIT
--pd---e--- OK (143 out of 1250, remaining: 08:41, took 0.3s, duration: 01:07)
test 0144...[FTP NLST dir list without contents, using PORT]
OUT: 220- _ _ ____ _
220- ___| | | | _ \| |
220- / __| | | | |_) | |
220- | (__| |_| | _ {| |___
220 \___|\___/|_| \_\_____|
IN: USER anonymous
IN: PASS ftp@example.com
IN: PWD
IN: EPRT |1|127.0.0.1|61830|
./server/sockfilt --ipv4 --connect 61830 --addr "127.0.0.1" --pidfile "./.ftp_sockdata.pid" --logfile "./log/ftp_sockdata.log"
IN: TYPE A
IN: NLST
IN: QUIT
--p----e--- OK (144 out of 1250, remaining: 08:38, took 0.2s, duration: 01:07)
test 0145...[FTP NLST dir list with weird reply code, using PORT]
* kill pid for ftp-data => 12596
OUT: 220- _ _ ____ _
220- ___| | | | _ \| |
220- / __| | | | |_) | |
220- | (__| |_| | _ {| |___
220 \___|\___/|_| \_\_____|
IN: USER anonymous
IN: PASS ftp@example.com
IN: PWD
IN: EPRT |1|127.0.0.1|61833|
./server/sockfilt --ipv4 --connect 61833 --addr "127.0.0.1" --pidfile "./.ftp_sockdata.pid" --logfile "./log/ftp_sockdata.log"
IN: TYPE A
IN: NLST
IN: QUIT
--p----e--- OK (145 out of 1250, remaining: 08:38, took 0.5s, duration: 01:08)
test 0146...[persistent FTP with different paths]
* kill pid for ftp-data => 6884
OUT: 220- _ _ ____ _
220- ___| | | | _ \| |
220- / __| | | | |_) | |
220- | (__| |_| | _ {| |___
220 \___|\___/|_| \_\_____|
IN: USER anonymous
IN: PASS ftp@example.com
IN: PWD
IN: CWD first
IN: CWD dir
IN: CWD here
IN: EPSV
./server/sockfilt --ipv4 --port 0 --pidfile "./.ftp_sockdata.pid" --logfile "./log/ftp_sockdata.log"
IN: TYPE I
IN: SIZE 146
IN: RETR 146
IN: CWD /
IN: EPSV
./server/sockfilt --ipv4 --port 0 --pidfile "./.ftp_sockdata.pid" --logfile "./log/ftp_sockdata.log"
IN: SIZE 146
IN: RETR 146
IN: QUIT
--pd---e--- OK (146 out of 1250, remaining: 08:41, took 0.9s, duration: 01:08)
test 0147...[FTP with --ftp-create-dirs (failing CWD)]
OUT: 220- _ _ ____ _
220- ___| | | | _ \| |
220- / __| | | | |_) | |
220- | (__| |_| | _ {| |___
220 \___|\___/|_| \_\_____|
IN: USER anonymous
IN: PASS ftp@example.com
IN: PWD
IN: CWD first
IN: MKD first
IN: CWD first
IN: CWD dir
IN: CWD here
IN: EPSV
./server/sockfilt --ipv4 --port 0 --pidfile "./.ftp_sockdata.pid" --logfile "./log/ftp_sockdata.log"
IN: TYPE I
IN: SIZE 147
IN: RETR 147
IN: QUIT
--pd---e--- OK (147 out of 1250, remaining: 09:54, took 10.3s, duration: 01:19)
test 0148...[FTP with --ftp-create-dirs (failing MKD)]
OUT: 220- _ _ ____ _
220- ___| | | | _ \| |
220- / __| | | | |_) | |
220- | (__| |_| | _ {| |___
220 \___|\___/|_| \_\_____|
IN: USER anonymous
IN: PASS ftp@example.com
IN: PWD
IN: CWD attempt
IN: MKD attempt
IN: CWD attempt
IN: QUIT
--p----e--- OK (148 out of 1250, remaining: 09:51, took 0.1s, duration: 01:19)
test 0149...[FTP with multiple uploads]
OUT: 220- _ _ ____ _
220- ___| | | | _ \| |
220- / __| | | | |_) | |
220- | (__| |_| | _ {| |___
220 \___|\___/|_| \_\_____|
IN: USER anonymous
IN: PASS ftp@example.com
IN: PWD
IN: CWD dir1
IN: EPSV
./server/sockfilt --ipv4 --port 0 --pidfile "./.ftp_sockdata.pid" --logfile "./log/ftp_sockdata.log"
IN: TYPE I
IN: STOR 149
IN: CWD /
IN: CWD dir2
IN: EPSV
./server/sockfilt --ipv4 --port 0 --pidfile "./.ftp_sockdata.pid" --logfile "./log/ftp_sockdata.log"
IN: STOR 149
IN: QUIT
--p---oe--- OK (149 out of 1250, remaining: 09:50, took 0.5s, duration: 01:19)
test 0151...[HTTP GET with an error code that might trick authentication]
--pd---e--- OK (151 out of 1250, remaining: 09:42, took 0.2s, duration: 01:20)
test 0152...[HTTP GET with an error code that might trick authentication and --fail]
--p----e--- OK (152 out of 1250, remaining: 09:40, took 0.3s, duration: 01:20)
test 0156...[HTTP PUT with --anyauth (when the server requires none)]
--pd---e--- OK (156 out of 1250, remaining: 09:31, took 1.2s, duration: 01:21)
test 0157...[HTTP GET with --anyauth (when the server requires none)]
--pd---e--- OK (157 out of 1250, remaining: 09:28, took 0.2s, duration: 01:21)
test 0158...[HTTP multipart formpost with only a 100 reply]
--pd---e--- OK (158 out of 1250, remaining: 09:26, took 0.2s, duration: 01:21)
test 0160...[HTTP with delayed close, conn reuse, connection reset and retry]
s-p----e--- OK (160 out of 1250, remaining: 09:33, took 2.3s, duration: 01:24)
test 0161...[FTP RETR PASV]
OUT: 220- _ _ ____ _
220- ___| | | | _ \| |
220- / __| | | | |_) | |
220- | (__| |_| | _ {| |___
220 \___|\___/|_| \_\_____|
IN: USER anonymous
IN: PASS ftp@example.com
IN: PWD
IN: EPSV
./server/sockfilt --ipv4 --port 0 --pidfile "./.ftp_sockdata.pid" --logfile "./log/ftp_sockdata.log"
IN: TYPE I
IN: SIZE 161
IN: RETR 161
--pd---e--- OK (161 out of 1250, remaining: 09:31, took 0.4s, duration: 01:24)
test 0163...[HTTP multipart formpost with contents from a file]
--pd---e--- OK (163 out of 1250, remaining: 09:25, took 0.2s, duration: 01:24)
test 0164...[HTTP range with multiple ranges]
--pd---e--- OK (164 out of 1250, remaining: 09:22, took 0.2s, duration: 01:24)
test 0165...[HTTP over proxy with IDN host name]

goto problem 20
165: protocol FAILED:
--- log/check-expected 2019-08-10 00:13:23.949646300 -0700
+++ log/check-generated 2019-08-10 00:13:23.949646300 -0700
@@ -1,10 +0,0 @@
-GET http://www.xn--4cab6c.se/page/165 HTTP/1.1[CR][LF]
-Host: www.xn--4cab6c.se[CR][LF]
-Accept: */*[CR][LF]
-Proxy-Connection: Keep-Alive[CR][LF]
-[CR][LF]
-GET http://www.xn--groe-xna.de/page/165 HTTP/1.1[CR][LF]
-Host: www.xn--groe-xna.de[CR][LF]
-Accept: */*[CR][LF]
-Proxy-Connection: Keep-Alive[CR][LF]
-[CR][LF]
== Contents of files in the log/ dir after test 165
=== Start of file check-expected
GET http://www.xn--4cab6c.se/page/165 HTTP/1.1[CR][LF]
Host: www.xn--4cab6c.se[CR][LF]
Accept: */*[CR][LF]
Proxy-Connection: Keep-Alive[CR][LF]
[CR][LF]
GET http://www.xn--groe-xna.de/page/165 HTTP/1.1[CR][LF]
Host: www.xn--groe-xna.de[CR][LF]
Accept: */*[CR][LF]
Proxy-Connection: Keep-Alive[CR][LF]
[CR][LF]
=== End of file check-expected
=== Start of file stderr165
curl: (3) Failed to convert www.[EF][BF][BD][EF][BF][BD][EF][BF][BD].se to ACE;
curl: (3) Failed to convert www.gro[EF][BF][BD]e.de to ACE;
=== End of file stderr165
=== Start of file trace165
09:13:23.296000 == Info: STATE: INIT => CONNECT handle 0x1a539c8; line 1362 (connection #-5000)
09:13:23.296000 == Info: Failed to convert www.[EF][BF][BD][EF][BF][BD][EF][BF][BD].se to ACE;
09:13:23.296000 == Info: Closing connection -1
09:13:23.296000 == Info: Expire cleared (transfer 0x1a539c8)
09:13:23.296000 == Info: STATE: INIT => CONNECT handle 0x1a71d90; line 1362 (connection #-5000)
09:13:23.296000 == Info: Failed to convert www.gro[EF][BF][BD]e.de to ACE;
09:13:23.296000 == Info: Closing connection -1
09:13:23.296000 == Info: Expire cleared (transfer 0x1a71d90)
=== End of file trace165
test 0166...[HTTP formpost a file with spaces in name]
--pd---e--- OK (166 out of 1250, remaining: 09:18, took 0.3s, duration: 01:25)
test 0171...[HTTP, get cookie with dot prefixed full domain]
--pd--oe--- OK (171 out of 1250, remaining: 09:00, took 0.1s, duration: 01:25)
test 0172...[HTTP with cookies file and custom added cookie]
--pd---e--- OK (172 out of 1250, remaining: 08:57, took 0.1s, duration: 01:25)
test 0173...[HTTP RFC1867-formpost a file from stdin with "faked" filename]
--pd---e--- OK (173 out of 1250, remaining: 08:55, took 0.2s, duration: 01:26)
test 0174...[HTTP POST --anyauth to server not requiring any auth at all]
--pd---e--- OK (174 out of 1250, remaining: 08:53, took 0.2s, duration: 01:26)
test 0175...[HTTP POST --digest to server not requiring any auth at all]
--pd---e--- OK (175 out of 1250, remaining: 08:52, took 0.3s, duration: 01:26)
test 0177...[HTTP POST --digest to server doing a 302-location response]
--pd---e--- OK (177 out of 1250, remaining: 08:46, took 0.2s, duration: 01:26)
test 0178...[HTTP response with negative Content-Length]
--pd---e--- OK (178 out of 1250, remaining: 08:44, took 0.2s, duration: 01:27)
test 0179...[HTTP using proxy and cookies with path checks]
--pd---e--- OK (179 out of 1250, remaining: 08:41, took 0.1s, duration: 01:27)
test 0180...[HTTP 1.0 PUT]
--pd---e--- OK (180 out of 1250, remaining: 08:39, took 0.2s, duration: 01:27)
test 0181...[HTTP 1.0 POST]
--pd---e--- OK (181 out of 1250, remaining: 08:37, took 0.2s, duration: 01:27)
test 0182...[FTP download an empty file]
OUT: 220- _ _ ____ _
220- ___| | | | _ \| |
220- / __| | | | |_) | |
220- | (__| |_| | _ {| |___
220 \___|\___/|_| \_\_____|
IN: USER anonymous
IN: PASS ftp@example.com
IN: PWD
IN: EPSV
./server/sockfilt --ipv4 --port 0 --pidfile "./.ftp_sockdata.pid" --logfile "./log/ftp_sockdata.log"
IN: TYPE I
IN: SIZE 182
IN: RETR 182
IN: QUIT
--pd---e--- OK (182 out of 1250, remaining: 08:36, took 0.4s, duration: 01:27)
test 0183...[HTTP GET two URLs over a single proxy with persistent connection]
--pd---e--- OK (183 out of 1250, remaining: 08:33, took 0.1s, duration: 01:28)
test 0184...[HTTP replace Host: when following Location: to new host]
--pd---e--- OK (184 out of 1250, remaining: 08:31, took 0.1s, duration: 01:28)
test 0185...[HTTP replace Host: when following Location: on the same host]
--pd---e--- OK (185 out of 1250, remaining: 08:28, took 0.1s, duration: 01:28)
test 0186...[HTTP RFC1867-type formposting with types on text fields]
--pd---e--- OK (186 out of 1250, remaining: 08:26, took 0.2s, duration: 01:28)
test 0187...[HTTP redirect with bad host name separation and slash in parameters]
--pd---e--- OK (187 out of 1250, remaining: 08:24, took 0.2s, duration: 01:28)
test 0188...[HTTP GET with resume and redirect]
--pd---e--- OK (188 out of 1250, remaining: 08:22, took 0.1s, duration: 01:28)
test 0189...[HTTP GET with resume and redirect (to a page that doesn't resume)]
--pd---e--- OK (189 out of 1250, remaining: 08:20, took 0.1s, duration: 01:29)
test 0190...[FTP download with strict timeout and slow CWD]
OUT: 220- _ _ ____ _
220- ___| | | | _ \| |
220- / __| | | | |_) | |
220- | (__| |_| | _ {| |___
220 \___|\___/|_| \_\_____|
IN: USER anonymous
IN: PASS ftp@example.com
IN: PWD
IN: CWD path
--p----e--- OK (190 out of 1250, remaining: 09:14, took 10.3s, duration: 01:39)
./server/sockfilt --ipv4 --port 8992 --pidfile "./.ftp_sockctrl.pid" --logfile "./log/ftp_sockctrl.log"
OUT: 220- _ _ ____ _
220- ___| | | | _ \| |
220- / __| | | | |_) | |
220- | (__| |_| | _ {| |___
220 \___|\___/|_| \_\_____|
IN: USER anonymous
IN: PASS ftp@example.com
IN: PWD
IN: EPSV
./server/sockfilt --ipv4 --port 0 --pidfile "./.ftp_sockdata.pid" --logfile "./log/ftp_sockdata.log"
IN: TYPE I
IN: SIZE verifiedserver
IN: RETR verifiedserver
FTPD: We returned proof we are the test server
IN: QUIT
test 0191...[FTP URL with ?-letters in username and password ]
OUT: 220- _ _ ____ _
220- ___| | | | _ \| |
220- / __| | | | |_) | |
220- | (__| |_| | _ {| |___
220 \___|\___/|_| \_\_____|
IN: USER use?r
IN: PASS pass?word
IN: PWD
IN: EPSV
./server/sockfilt --ipv4 --port 0 --pidfile "./.ftp_sockdata.pid" --logfile "./log/ftp_sockdata.log"
IN: TYPE I
IN: SIZE 191
IN: RETR 191
IN: QUIT
--pd---e--- OK (191 out of 1250, remaining: 09:26, took 2.8s, duration: 01:42)
test 0192...[HTTP GET -w num_connects with one simple connect]
s-p----e--- OK (192 out of 1250, remaining: 09:23, took 0.1s, duration: 01:42)
test 0193...[HTTP GET -w num_connects with redirected fetch (2 connects)]
s-p----e--- OK (193 out of 1250, remaining: 09:21, took 0.2s, duration: 01:42)
test 0194...[HTTP resume transfer with the whole file already downloaded and --fail]
--pd---e--- OK (194 out of 1250, remaining: 09:19, took 0.3s, duration: 01:42)
test 0195...[FTP response 530 after PASS, temporarily not allowed access]
OUT: 220- _ _ ____ _
220- ___| | | | _ \| |
220- / __| | | | |_) | |
220- | (__| |_| | _ {| |___
220 \___|\___/|_| \_\_____|
IN: USER anonymous
IN: PASS ftp@example.com
--p----e--- OK (195 out of 1250, remaining: 09:16, took 0.2s, duration: 01:42)
test 0196...[FTP transient error, retry request once]
OUT: 220- _ _ ____ _
220- ___| | | | _ \| |
220- / __| | | | |_) | |
220- | (__| |_| | _ {| |___
220 \___|\___/|_| \_\_____|
IN: USER anonymous
IN: PASS ftp@example.com
OUT: 220- _ _ ____ _
220- ___| | | | _ \| |
220- / __| | | | |_) | |
220- | (__| |_| | _ {| |___
220 \___|\___/|_| \_\_____|
IN: USER anonymous
IN: PASS ftp@example.com
--p----e--- OK (196 out of 1250, remaining: 09:19, took 1.2s, duration: 01:44)
test 0197...[HTTP GET --retry on 503 error with output to stdout]
s-p----e--- OK (197 out of 1250, remaining: 09:22, took 1.1s, duration: 01:45)
test 0198...[HTTP GET --retry on 503 error with output to file]
--pd---e--- OK (198 out of 1250, remaining: 09:25, took 1.1s, duration: 01:46)
test 0199...[HTTP with -d, -G and {}]
--pd---e--- OK (199 out of 1250, remaining: 09:22, took 0.2s, duration: 01:46)
test 0200...[basic file:// file]
---d---e--- OK (200 out of 1250, remaining: 09:20, took 0.1s, duration: 01:46)
test 0201...[missing file:// file]
-------e--- OK (201 out of 1250, remaining: 09:17, took 0.1s, duration: 01:46)
test 0202...[two file:// URLs to stdout]
s------e--- OK (202 out of 1250, remaining: 09:14, took 0.1s, duration: 01:46)
test 0203...[file:/path URL with a single slash]
---d---e--- OK (203 out of 1250, remaining: 09:12, took 0.1s, duration: 01:47)
test 0204...["upload" with file://]
------oe--- OK (204 out of 1250, remaining: 09:09, took 0.1s, duration: 01:47)
test 0205...["upload" with file://]
-------e--- OK (205 out of 1250, remaining: 09:07, took 0.1s, duration: 01:47)
test 0207...[HTTP GET with chunked Transfer-Encoding closed prematurely]
--pd---e--- OK (207 out of 1250, remaining: 09:01, took 0.2s, duration: 01:47)
test 0208...[HTTP PUT to a FTP URL with username+password - over HTTP proxy]
--pd---e--- OK (208 out of 1250, remaining: 09:04, took 1.2s, duration: 01:48)
test 0210...[Get two FTP files from the same remote dir: no second CWD]
OUT: 220- _ _ ____ _
220- ___| | | | _ \| |
220- / __| | | | |_) | |
220- | (__| |_| | _ {| |___
220 \___|\___/|_| \_\_____|
IN: USER anonymous
IN: PASS ftp@example.com
IN: PWD
IN: CWD a
IN: CWD path
IN: EPSV
./server/sockfilt --ipv4 --port 0 --pidfile "./.ftp_sockdata.pid" --logfile "./log/ftp_sockdata.log"
IN: TYPE I
IN: SIZE 210
IN: RETR 210
IN: EPSV
./server/sockfilt --ipv4 --port 0 --pidfile "./.ftp_sockdata.pid" --logfile "./log/ftp_sockdata.log"
IN: SIZE 210
IN: RETR 210
IN: QUIT
--pd---e--- OK (210 out of 1250, remaining: 09:52, took 10.8s, duration: 01:59)
test 0211...[Get two FTP files with no remote EPSV support]
OUT: 220- _ _ ____ _
220- ___| | | | _ \| |
220- / __| | | | |_) | |
220- | (__| |_| | _ {| |___
220 \___|\___/|_| \_\_____|
IN: USER anonymous
IN: PASS ftp@example.com
IN: PWD
IN: CWD a
IN: CWD path
IN: EPSV
IN: PASV
./server/sockfilt --ipv4 --port 0 --pidfile "./.ftp_sockdata.pid" --logfile "./log/ftp_sockdata.log"
IN: TYPE I
IN: SIZE 211
IN: RETR 211
IN: PASV
./server/sockfilt --ipv4 --port 0 --pidfile "./.ftp_sockdata.pid" --logfile "./log/ftp_sockdata.log"
IN: SIZE 211
IN: RETR 211
IN: QUIT
--pd---e--- OK (211 out of 1250, remaining: 09:51, took 0.5s, duration: 02:00)
test 0212...[Get two FTP files with no remote EPRT support]
OUT: 220- _ _ ____ _
220- ___| | | | _ \| |
220- / __| | | | |_) | |
220- | (__| |_| | _ {| |___
220 \___|\___/|_| \_\_____|
IN: USER anonymous
IN: PASS ftp@example.com
IN: PWD
IN: CWD a
IN: CWD path
IN: EPRT |1|127.0.0.1|61919|
IN: PORT 127,0,0,1,241,224
./server/sockfilt --ipv4 --connect 61920 --addr "127.0.0.1" --pidfile "./.ftp_sockdata.pid" --logfile "./log/ftp_sockdata.log"
IN: TYPE I
IN: SIZE 212
IN: RETR 212
IN: PORT 127,0,0,1,241,226
./server/sockfilt --ipv4 --connect 61922 --addr "127.0.0.1" --pidfile "./.ftp_sockdata.pid" --logfile "./log/ftp_sockdata.log"
IN: SIZE 212
IN: RETR 212
IN: QUIT
--pd---e--- OK (212 out of 1250, remaining: 09:50, took 0.5s, duration: 02:00)
test 0214...[HTTP URL with escaped { and }]
--pd---e--- OK (214 out of 1250, remaining: 09:43, took 0.1s, duration: 02:00)
test 0215...[Get two FTP dir listings from the same remote dir: no second CWD]
OUT: 220- _ _ ____ _
220- ___| | | | _ \| |
220- / __| | | | |_) | |
220- | (__| |_| | _ {| |___
220 \___|\___/|_| \_\_____|
IN: USER anonymous
IN: PASS ftp@example.com
IN: PWD
IN: CWD a
IN: CWD path
IN: CWD 215
IN: EPSV
./server/sockfilt --ipv4 --port 0 --pidfile "./.ftp_sockdata.pid" --logfile "./log/ftp_sockdata.log"
IN: TYPE A
IN: LIST
IN: EPSV
./server/sockfilt --ipv4 --port 0 --pidfile "./.ftp_sockdata.pid" --logfile "./log/ftp_sockdata.log"
IN: LIST
IN: QUIT
--pd---e--- OK (215 out of 1250, remaining: 09:43, took 0.5s, duration: 02:01)
test 0216...[FTP upload two files to the same dir]
OUT: 220- _ _ ____ _
220- ___| | | | _ \| |
220- / __| | | | |_) | |
220- | (__| |_| | _ {| |___
220 \___|\___/|_| \_\_____|
IN: USER anonymous
IN: PASS ftp@example.com
IN: PWD
IN: CWD a
IN: CWD path
IN: CWD 216
IN: EPSV
./server/sockfilt --ipv4 --port 0 --pidfile "./.ftp_sockdata.pid" --logfile "./log/ftp_sockdata.log"
IN: TYPE I
IN: STOR upload.216
IN: EPSV
./server/sockfilt --ipv4 --port 0 --pidfile "./.ftp_sockdata.pid" --logfile "./log/ftp_sockdata.log"
IN: STOR ..anotherup.216
IN: QUIT
--p----e--- OK (216 out of 1250, remaining: 09:42, took 0.5s, duration: 02:01)
test 0217...[HTTP proxy CONNECT to proxy returning 405]
s-p----e--- OK (217 out of 1250, remaining: 09:40, took 0.2s, duration: 02:01)
test 0218...[HTTP PUT from a file but enforce chunked transfer-encoding]
--pd---e--- OK (218 out of 1250, remaining: 09:42, took 1.1s, duration: 02:03)
test 0219...[try using proxy with unsupported scheme]
-------e--- OK (219 out of 1250, remaining: 09:39, took 0.1s, duration: 02:03)
test 0220...[HTTP GET gzip compressed content]
--pd---e--- OK (220 out of 1250, remaining: 09:37, took 0.1s, duration: 02:03)
test 0221...[HTTP GET gzip compressed content with broken gzip header]
--pd---e--- OK (221 out of 1250, remaining: 09:34, took 0.1s, duration: 02:03)
test 0222...[HTTP GET deflate compressed content]
--pd---e--- OK (222 out of 1250, remaining: 09:32, took 0.1s, duration: 02:03)
test 0223...[HTTP GET deflate compressed content with broken deflate header]
--pd---e--- OK (223 out of 1250, remaining: 09:29, took 0.2s, duration: 02:03)
test 0224...[HTTP GET gzip compressed content with huge comment and extra field]
--pd---e--- OK (224 out of 1250, remaining: 09:27, took 0.1s, duration: 02:03)
test 0225...[FTP %0a-code in URL's name part]
-------e--- OK (225 out of 1250, remaining: 09:24, took 0.1s, duration: 02:03)
test 0226...[FTP %0d-code in URL's CWD part]
OUT: 220- _ _ ____ _
220- ___| | | | _ \| |
220- / __| | | | |_) | |
220- | (__| |_| | _ {| |___
220 \___|\___/|_| \_\_____|
IN: USER anonymous
IN: PASS ftp@example.com
IN: PWD
-------e--- OK (226 out of 1250, remaining: 09:22, took 0.1s, duration: 02:04)
test 0227...[FTP with quote ops]
OUT: 220- _ _ ____ _
220- ___| | | | _ \| |
220- / __| | | | |_) | |
220- | (__| |_| | _ {| |___
220 \___|\___/|_| \_\_____|
IN: USER anonymous
IN: PASS ftp@example.com
IN: PWD
IN: NOOP 1
IN: FAIL
IN: EPSV
IN: PASV
./server/sockfilt --ipv4 --port 0 --pidfile "./.ftp_sockdata.pid" --logfile "./log/ftp_sockdata.log"
IN: TYPE I
IN: NOOP 2
IN: FAIL HARD
IN: SIZE 227
IN: RETR 227
IN: NOOP 3
IN: QUIT
--pd---e--- OK (227 out of 1250, remaining: 09:20, took 0.4s, duration: 02:04)
test 0228...[FTP RETR with ACCT]
OUT: 220- _ _ ____ _
220- ___| | | | _ \| |
220- / __| | | | |_) | |
220- | (__| |_| | _ {| |___
220 \___|\___/|_| \_\_____|
IN: USER anonymous
IN: PASS ftp@example.com
IN: ACCT one count
IN: PWD
IN: EPSV
./server/sockfilt --ipv4 --port 0 --pidfile "./.ftp_sockdata.pid" --logfile "./log/ftp_sockdata.log"
IN: TYPE I
IN: SIZE 228
IN: RETR 228
IN: QUIT
--pd---e--- OK (228 out of 1250, remaining: 09:19, took 0.3s, duration: 02:04)
test 0229...[FTP RETR with bad ACCT]
OUT: 220- _ _ ____ _
220- ___| | | | _ \| |
220- / __| | | | |_) | |
220- | (__| |_| | _ {| |___
220 \___|\___/|_| \_\_____|
IN: USER anonymous
IN: PASS ftp@example.com
IN: ACCT one count
--p----e--- OK (229 out of 1250, remaining: 09:17, took 0.1s, duration: 02:04)
test 0230...[HTTP GET multiply compressed content]
--pd---e--- OK (230 out of 1250, remaining: 09:14, took 0.1s, duration: 02:05)
test 0231...[file:// with resume]
---d---e--- OK (231 out of 1250, remaining: 09:12, took 0.1s, duration: 02:05)
test 0232...[HTTP GET deflate raw-compressed content]
--pd---e--- OK (232 out of 1250, remaining: 09:10, took 0.2s, duration: 02:05)
test 0233...[HTTP, proxy, site+proxy auth and Location: to new host]
--pd---e--- OK (233 out of 1250, remaining: 09:08, took 0.2s, duration: 02:05)
test 0234...[HTTP, proxy, site+proxy auth and Location: to new host using location-trusted]
--pd---e--- OK (234 out of 1250, remaining: 09:06, took 0.3s, duration: 02:05)
test 0235...[FTP resumed upload but no file present remotely]
OUT: 220- _ _ ____ _
220- ___| | | | _ \| |
220- / __| | | | |_) | |
220- | (__| |_| | _ {| |___
220 \___|\___/|_| \_\_____|
IN: USER anonymous
IN: PASS ftp@example.com
IN: PWD
IN: EPSV
./server/sockfilt --ipv4 --port 0 --pidfile "./.ftp_sockdata.pid" --logfile "./log/ftp_sockdata.log"
IN: TYPE I
IN: SIZE 235
IN: STOR 235
IN: QUIT
--p-u--e--- OK (235 out of 1250, remaining: 09:05, took 0.3s, duration: 02:06)
test 0236...[FTP resume upload but denied access to remote file]
OUT: 220- _ _ ____ _
220- ___| | | | _ \| |
220- / __| | | | |_) | |
220- | (__| |_| | _ {| |___
220 \___|\___/|_| \_\_____|
IN: USER anonymous
IN: PASS ftp@example.com
IN: PWD
IN: EPSV
./server/sockfilt --ipv4 --port 0 --pidfile "./.ftp_sockdata.pid" --logfile "./log/ftp_sockdata.log"
IN: TYPE I
IN: SIZE 236
IN: STOR 236
IN: QUIT
--p----e--- OK (236 out of 1250, remaining: 09:03, took 0.2s, duration: 02:06)
test 0237...[FTP getting bad host in 227-response to PASV]
* kill pid for ftp-data => 2324
OUT: 220- _ _ ____ _
220- ___| | | | _ \| |
220- / __| | | | |_) | |
220- | (__| |_| | _ {| |___
220 \___|\___/|_| \_\_____|
IN: USER anonymous
IN: PASS ftp@example.com
IN: PWD
IN: PASV
--p----e--- OK (237 out of 1250, remaining: 09:02, took 0.4s, duration: 02:06)
test 0238...[FTP getting bad port in response to EPSV]
OUT: 220- _ _ ____ _
220- ___| | | | _ \| |
220- / __| | | | |_) | |
220- | (__| |_| | _ {| |___
220 \___|\___/|_| \_\_____|
IN: USER anonymous
IN: PASS ftp@example.com
IN: PWD
IN: EPSV
IN: QUIT
--p----e--- OK (238 out of 1250, remaining: 09:00, took 0.1s, duration: 02:07)
RUN: server/sws --pidfile ".http_ipv6_server.pid" --logfile "log/http_ipv6_server.log" --ipv6 --port 8994 --srcdir "/tests"
test 0240...[HTTP-IPv6 GET]
--pd---e--- OK (240 out of 1250, remaining: 09:04, took 2.4s, duration: 02:09)
test 0241 SKIPPED: Resolving IPv6 'ip6-localhost' didn't work
test 0242...[HTTP-IPv6 GET with username+password in URL]
--pd---e--- OK (242 out of 1250, remaining: 09:03, took 0.1s, duration: 02:10)
test 0244...[FTP dir listing with nocwd and URL encoded path]
OUT: 220- _ _ ____ _
220- ___| | | | _ \| |
220- / __| | | | |_) | |
220- | (__| |_| | _ {| |___
220 \___|\___/|_| \_\_____|
IN: USER anonymous
IN: PASS ftp@example.com
IN: PWD
IN: EPSV
./server/sockfilt --ipv4 --port 0 --pidfile "./.ftp_sockdata.pid" --logfile "./log/ftp_sockdata.log"
IN: TYPE A
IN: LIST fir#t/third/244/
IN: QUIT
--pd---e--- OK (244 out of 1250, remaining: 08:59, took 0.3s, duration: 02:10)
test 0247...[FTP upload time condition evaluates TRUE => skip upload]
OUT: 220- _ _ ____ _
220- ___| | | | _ \| |
220- / __| | | | |_) | |
220- | (__| |_| | _ {| |___
220 \___|\___/|_| \_\_____|
IN: USER anonymous
IN: PASS ftp@example.com
IN: PWD
IN: MDTM 247
IN: QUIT
--p----e--- OK (247 out of 1250, remaining: 08:51, took 0.1s, duration: 02:11)
test 0248...[FTP upload time condition evaluates FALSE => upload anyway]
OUT: 220- _ _ ____ _
220- ___| | | | _ \| |
220- / __| | | | |_) | |
220- | (__| |_| | _ {| |___
220 \___|\___/|_| \_\_____|
IN: USER anonymous
IN: PASS ftp@example.com
IN: PWD
IN: MDTM 248
IN: EPSV
./server/sockfilt --ipv4 --port 0 --pidfile "./.ftp_sockdata.pid" --logfile "./log/ftp_sockdata.log"
IN: TYPE I
IN: STOR 248
IN: QUIT
--p-u--e--- OK (248 out of 1250, remaining: 08:50, took 0.4s, duration: 02:11)
test 0249...[HTTP 304 response with "illegal" Content-Length: header]
--pd---e--- OK (249 out of 1250, remaining: 08:49, took 0.2s, duration: 02:11)
test 0250...[FTP dir list PASV with slow response]
OUT: 220- _ _ ____ _
220- ___| | | | _ \| |
220- / __| | | | |_) | |
220- | (__| |_| | _ {| |___
220 \___|\___/|_| \_\_____|
IN: USER anonymous
IN: PASS ftp@example.com
IN: PWD
IN: EPSV
./server/sockfilt --ipv4 --port 0 --pidfile "./.ftp_sockdata.pid" --logfile "./log/ftp_sockdata.log"
IN: TYPE A
IN: LIST
IN: QUIT
--pd---e--- OK (250 out of 1250, remaining: 09:51, took 16.2s, duration: 02:27)
test 0251...[FTP dir list, PORT with specified IP and slow response]
OUT: 220- _ _ ____ _
220- ___| | | | _ \| |
220- / __| | | | |_) | |
220- | (__| |_| | _ {| |___
220 \___|\___/|_| \_\_____|
IN: USER anonymous
IN: PASS ftp@example.com
IN: PWD
IN: EPRT |1|127.0.0.1|61981|
./server/sockfilt --ipv4 --connect 61981 --addr "127.0.0.1" --pidfile "./.ftp_sockdata.pid" --logfile "./log/ftp_sockdata.log"
IN: TYPE A
IN: LIST
IN: QUIT
--pd---e--- OK (251 out of 1250, remaining: 11:24, took 24.0s, duration: 02:51)
./server/sockfilt --ipv6 --port 8996 --pidfile "./.ftp_ipv6_sockctrl.pid" --logfile "./log/ftp_ipv6_sockctrl.log"
OUT: 220- _ _ ____ _
220- ___| | | | _ \| |
220- / __| | | | |_) | |
220- | (__| |_| | _ {| |___
220 \___|\___/|_| \_\_____|
IN: USER anonymous
IN: PASS ftp@example.com
IN: PWD
IN: EPSV
./server/sockfilt --ipv6 --port 0 --pidfile "./.ftp_ipv6_sockdata.pid" --logfile "./log/ftp_ipv6_sockdata.log"
IN: TYPE I
IN: SIZE verifiedserver
IN: RETR verifiedserver
FTPD: We returned proof we are the test server
IN: QUIT
test 0252...[FTP IPv6 dir list PASV]
OUT: 220- _ _ ____ _
220- ___| | | | _ \| |
220- / __| | | | |_) | |
220- | (__| |_| | _ {| |___
220 \___|\___/|_| \_\_____|
IN: USER anonymous
IN: PASS ftp@example.com
IN: PWD
IN: EPSV
./server/sockfilt --ipv6 --port 0 --pidfile "./.ftp_ipv6_sockdata.pid" --logfile "./log/ftp_ipv6_sockdata.log"
IN: TYPE A
IN: LIST
IN: QUIT
--pd---e--- OK (252 out of 1250, remaining: 11:31, took 2.7s, duration: 02:54)
test 0253...[FTP IPv6 dir list with EPRT]
OUT: 220- _ _ ____ _
220- ___| | | | _ \| |
220- / __| | | | |_) | |
220- | (__| |_| | _ {| |___
220 \___|\___/|_| \_\_____|
IN: USER anonymous
IN: PASS ftp@example.com
IN: PWD
IN: EPRT |2|::1|61990|
./server/sockfilt --ipv6 --connect 61990 --addr "::1" --pidfile "./.ftp_ipv6_sockdata.pid" --logfile "./log/ftp_ipv6_sockdata.log"
IN: TYPE A
IN: LIST
IN: QUIT
--pd---e--- OK (253 out of 1250, remaining: 11:28, took 0.3s, duration: 02:54)
test 0254...[FTP IPv6 dir list PASV and --disable-epsv]
OUT: 220- _ _ ____ _
220- ___| | | | _ \| |
220- / __| | | | |_) | |
220- | (__| |_| | _ {| |___
220 \___|\___/|_| \_\_____|
IN: USER anonymous
IN: PASS ftp@example.com
IN: PWD
IN: EPSV
./server/sockfilt --ipv6 --port 0 --pidfile "./.ftp_ipv6_sockdata.pid" --logfile "./log/ftp_ipv6_sockdata.log"
IN: TYPE A
IN: LIST
IN: QUIT
--pd---e--- OK (254 out of 1250, remaining: 11:26, took 0.3s, duration: 02:55)
test 0255...[FTP IPv6 dir list with EPRT and --disable-eprt]
OUT: 220- _ _ ____ _
220- ___| | | | _ \| |
220- / __| | | | |_) | |
220- | (__| |_| | _ {| |___
220 \___|\___/|_| \_\_____|
IN: USER anonymous
IN: PASS ftp@example.com
IN: PWD
IN: EPRT |2|::1|61996|
./server/sockfilt --ipv6 --connect 61996 --addr "::1" --pidfile "./.ftp_ipv6_sockdata.pid" --logfile "./log/ftp_ipv6_sockdata.log"
IN: TYPE A
IN: LIST
IN: QUIT
--pd---e--- OK (255 out of 1250, remaining: 11:24, took 0.3s, duration: 02:55)
test 0256...[HTTP resume request over proxy with auth without server supporting it]
--p---oe--- OK (256 out of 1250, remaining: 11:21, took 0.1s, duration: 02:55)
test 0257...[HTTP Location: following with --netrc-optional]
--pd---e--- OK (257 out of 1250, remaining: 11:19, took 0.3s, duration: 02:55)
test 0260...[HTTP GET URL without slash but with questionmark]
--pd---e--- OK (260 out of 1250, remaining: 11:10, took 0.1s, duration: 02:55)
test 0261...[FTP RETR with 226 response code to TYPE]
OUT: 220- _ _ ____ _
220- ___| | | | _ \| |
220- / __| | | | |_) | |
220- | (__| |_| | _ {| |___
220 \___|\___/|_| \_\_____|
IN: USER anonymous
IN: PASS ftp@example.com
IN: PWD
IN: EPSV
./server/sockfilt --ipv4 --port 0 --pidfile "./.ftp_sockdata.pid" --logfile "./log/ftp_sockdata.log"
IN: TYPE I
IN: SIZE 261
IN: RETR 261
IN: QUIT
--pd---e--- OK (261 out of 1250, remaining: 11:07, took 0.3s, duration: 02:56)
test 0262...[HTTP GET with binary zeroes in header]
--pd---e--- OK (262 out of 1250, remaining: 11:05, took 0.1s, duration: 02:56)
test 0263...[HTTP-IPv6 GET with proxy specified using IPv6-numerical address]
--pd---e--- OK (263 out of 1250, remaining: 11:02, took 0.1s, duration: 02:56)
test 0264...[HTTP with proxy string including http:// and user+password]
--pd---e--- OK (264 out of 1250, remaining: 11:00, took 0.2s, duration: 02:56)
test 0266...[HTTP GET with chunked Transfer-Encoding and chunked trailer]
--pd--oe--- OK (266 out of 1250, remaining: 10:54, took 0.1s, duration: 02:56)
test 0268...[HTTP POST a non-existing file]
--pd---e--- OK (268 out of 1250, remaining: 10:48, took 0.1s, duration: 02:56)
test 0269...[HTTP --ignore-content-length]
--pd---e--- OK (269 out of 1250, remaining: 10:45, took 0.2s, duration: 02:57)
test 0270...[FTP RETR PASV --ftp-skip-pasv-ip]
OUT: 220- _ _ ____ _
220- ___| | | | _ \| |
220- / __| | | | |_) | |
220- | (__| |_| | _ {| |___
220 \___|\___/|_| \_\_____|
IN: USER anonymous
IN: PASS ftp@example.com
IN: PWD
IN: PASV
./server/sockfilt --ipv4 --port 0 --pidfile "./.ftp_sockdata.pid" --logfile "./log/ftp_sockdata.log"
IN: TYPE I
IN: SIZE 270
IN: RETR 270
IN: QUIT
--pd---e--- OK (270 out of 1250, remaining: 10:43, took 0.3s, duration: 02:57)
test 0271...[TFTP retrieve]
--pd---e--- OK (271 out of 1250, remaining: 10:49, took 2.4s, duration: 02:59)
test 0272...[FTP timed conditioned get file with identical time stamp ]
OUT: 220- _ _ ____ _
220- ___| | | | _ \| |
220- / __| | | | |_) | |
220- | (__| |_| | _ {| |___
220 \___|\___/|_| \_\_____|
IN: USER anonymous
IN: PASS ftp@example.com
IN: PWD
IN: MDTM 272
IN: QUIT
--p----e--- OK (272 out of 1250, remaining: 10:46, took 0.1s, duration: 02:59)
test 0274...[HTTP Location: following with --max-redirs 0]
--pd---e--- OK (274 out of 1250, remaining: 10:41, took 0.2s, duration: 03:00)
test 0275...[HTTP CONNECT with proxytunnel getting two URLs from the same host]
--pd-P-e--- OK (275 out of 1250, remaining: 10:41, took 0.6s, duration: 03:00)
test 0276...[HTTP Location: following with multiple question marks in URLs]
--pd---e--- OK (276 out of 1250, remaining: 10:39, took 0.3s, duration: 03:01)
test 0277...[HTTP RFC1867-type formposting with custom Content-Type]
--pd---e--- OK (277 out of 1250, remaining: 10:36, took 0.2s, duration: 03:01)
test 0278...[HTTP with proxy string including http:// and user+empty password]
--pd---e--- OK (278 out of 1250, remaining: 10:34, took 0.2s, duration: 03:01)
test 0279...[HTTP with proxy string including http:// and user only]
--pd---e--- OK (279 out of 1250, remaining: 10:32, took 0.2s, duration: 03:01)
test 0280...[FTP --ftp-alternative-to-user on USER failure]
OUT: 220- _ _ ____ _
220- ___| | | | _ \| |
220- / __| | | | |_) | |
220- | (__| |_| | _ {| |___
220 \___|\___/|_| \_\_____|
IN: USER anonymous
IN: USER replacement
IN: PASS ftp@example.com
IN: PWD
IN: CWD 280
IN: EPSV
./server/sockfilt --ipv4 --port 0 --pidfile "./.ftp_sockdata.pid" --logfile "./log/ftp_sockdata.log"
IN: TYPE A
IN: LIST
IN: QUIT
--pd---e--- OK (280 out of 1250, remaining: 10:30, took 0.3s, duration: 03:02)
test 0281...[HTTP PUT from file with 100 + 401 responses and -f without auth given]
--pd---e--- OK (281 out of 1250, remaining: 10:32, took 1.2s, duration: 03:03)
test 0282...[HTTP GET with no response body or headers]
--pd---e--- OK (282 out of 1250, remaining: 10:29, took 0.2s, duration: 03:03)
test 0283...[TFTP retrieve on invalid file]
--p----e--- OK (283 out of 1250, remaining: 10:27, took 0.1s, duration: 03:03)
test 0284...[TFTP retrieve of boundary case 512 byte file]
--pd---e--- OK (284 out of 1250, remaining: 10:25, took 0.1s, duration: 03:03)
test 0285...[TFTP send]
Warning: server logs lock timeout (2 seconds) expired
--p-u--e--- OK (285 out of 1250, remaining: 10:30, took 2.6s, duration: 03:06)
test 0286...[TFTP send of boundary case 512 byte file]
Warning: server logs lock timeout (2 seconds) expired
--p-u--e--- OK (286 out of 1250, remaining: 10:56, took 8.4s, duration: 03:14)
test 0287...[HTTP proxy CONNECT with custom User-Agent header]
s-p----e--- OK (287 out of 1250, remaining: 11:04, took 3.2s, duration: 03:17)
test 0288...[file:// with (unsupported) proxy, authentication and range]
---d---e--- OK (288 out of 1250, remaining: 11:03, took 0.5s, duration: 03:18)
test 0289...[FTP resume upload but denied access to local file]
-------e--- OK (289 out of 1250, remaining: 11:00, took 0.1s, duration: 03:18)
test 0290...[FTP download maximum filesize exceeded]
OUT: 220- _ _ ____ _
220- ___| | | | _ \| |
220- / __| | | | |_) | |
220- | (__| |_| | _ {| |___
220 \___|\___/|_| \_\_____|
IN: USER anonymous
IN: PASS ftp@example.com
IN: PWD
IN: EPSV
./server/sockfilt --ipv4 --port 0 --pidfile "./.ftp_sockdata.pid" --logfile "./log/ftp_sockdata.log"
IN: TYPE I
IN: SIZE 290
IN: QUIT
--p----e--- OK (290 out of 1250, remaining: 10:58, took 0.2s, duration: 03:18)
test 0291...[FTP download maximum filesize not exceeded]
* kill pid for ftp-data => 740
OUT: 220- _ _ ____ _
220- ___| | | | _ \| |
220- / __| | | | |_) | |
220- | (__| |_| | _ {| |___
220 \___|\___/|_| \_\_____|
IN: USER anonymous
IN: PASS ftp@example.com
IN: PWD
IN: EPSV
./server/sockfilt --ipv4 --port 0 --pidfile "./.ftp_sockdata.pid" --logfile "./log/ftp_sockdata.log"
IN: TYPE I
IN: SIZE 291
IN: RETR 291
IN: QUIT
--pd---e--- OK (291 out of 1250, remaining: 10:57, took 0.6s, duration: 03:19)
test 0292...[HTTP GET with maximum filesize not exceeded]
--pd---e--- OK (292 out of 1250, remaining: 10:54, took 0.1s, duration: 03:19)
test 0293...[HTTP GET with maximum filesize exceeded]
--p----e--- OK (293 out of 1250, remaining: 10:52, took 0.1s, duration: 03:19)
test 0294...[FTP --ftp-account on ACCT request]
OUT: 220- _ _ ____ _
220- ___| | | | _ \| |
220- / __| | | | |_) | |
220- | (__| |_| | _ {| |___
220 \___|\___/|_| \_\_____|
IN: USER anonymous
IN: PASS ftp@example.com
IN: ACCT data for acct
IN: PWD
IN: CWD 294
IN: EPSV
./server/sockfilt --ipv4 --port 0 --pidfile "./.ftp_sockdata.pid" --logfile "./log/ftp_sockdata.log"
IN: TYPE A
IN: LIST
IN: QUIT
--pd---e--- OK (294 out of 1250, remaining: 10:50, took 0.3s, duration: 03:19)
test 0295...[FTP ACCT request without --ftp-account]
OUT: 220- _ _ ____ _
220- ___| | | | _ \| |
220- / __| | | | |_) | |
220- | (__| |_| | _ {| |___
220 \___|\___/|_| \_\_____|
IN: USER anonymous
IN: PASS ftp@example.com
--p----e--- OK (295 out of 1250, remaining: 10:47, took 0.1s, duration: 03:20)
test 0296...[FTP CWD with --ftp-method multicwd]
OUT: 220- _ _ ____ _
220- ___| | | | _ \| |
220- / __| | | | |_) | |
220- | (__| |_| | _ {| |___
220 \___|\___/|_| \_\_____|
IN: USER anonymous
IN: PASS ftp@example.com
IN: PWD
IN: CWD first
IN: CWD second
IN: CWD third
IN: EPSV
./server/sockfilt --ipv4 --port 0 --pidfile "./.ftp_sockdata.pid" --logfile "./log/ftp_sockdata.log"
IN: TYPE I
IN: SIZE 296
IN: RETR 296
IN: QUIT
--pd---e--- OK (296 out of 1250, remaining: 10:45, took 0.3s, duration: 03:20)
test 0297...[FTP CWD with --ftp-method singlecwd]
OUT: 220- _ _ ____ _
220- ___| | | | _ \| |
220- / __| | | | |_) | |
220- | (__| |_| | _ {| |___
220 \___|\___/|_| \_\_____|
IN: USER anonymous
IN: PASS ftp@example.com
IN: PWD
IN: CWD first/second/third
IN: EPSV
./server/sockfilt --ipv4 --port 0 --pidfile "./.ftp_sockdata.pid" --logfile "./log/ftp_sockdata.log"
IN: TYPE I
IN: SIZE 297
IN: RETR 297
IN: QUIT
--pd---e--- OK (297 out of 1250, remaining: 10:43, took 0.3s, duration: 03:20)
test 0298...[FTP CWD with --ftp-method nocwd]
OUT: 220- _ _ ____ _
220- ___| | | | _ \| |
220- / __| | | | |_) | |
220- | (__| |_| | _ {| |___
220 \___|\___/|_| \_\_____|
IN: USER anonymous
IN: PASS ftp@example.com
IN: PWD
IN: EPSV
./server/sockfilt --ipv4 --port 0 --pidfile "./.ftp_sockdata.pid" --logfile "./log/ftp_sockdata.log"
IN: TYPE I
IN: SIZE first/second/third/298
IN: RETR first/second/third/298
IN: QUIT
--pd---e--- OK (298 out of 1250, remaining: 10:41, took 0.3s, duration: 03:20)
test 0299...[FTP over HTTP proxy with user:pass not in url]
--pd---e--- OK (299 out of 1250, remaining: 10:39, took 0.2s, duration: 03:21)
Inter result: "/build-1440/tests"
Inter result: "/tests/stunnel.pem"
HTTPS server (stunnel 5.54)
cmd: "/c/Program Files (x86)/stunnel/bin/tstunnel" /build-1440/tests/https_stunnel.conf >/build-1440/tests/log/https_stunnel.log 2>&1
CApath = C:/Buildbot/curl_winssl_msys2_mingw32_dbg/build/build-1440/tests
cert = C:/Buildbot/curl_winssl_msys2_mingw32_dbg/build/tests/stunnel.pem
debug = 5
socket = a:SO_REUSEADDR=1
socket = a:SO_EXCLUSIVEADDRUSE=0

[curltest]
accept = 8991
connect = 8990
RUN: Unknown server on our https port: 8991 (28)
RUN: HTTPS server failed verification
== Contents of files in the log/ dir after test 300
=== Start of file https_stunnel.log
2019.08.10 09:15:20 LOG5[ui]: stunnel 5.54 on x64-pc-mingw32-gnu platform
2019.08.10 09:15:20 LOG5[ui]: Compiled/running with OpenSSL 1.1.1b 26 Feb 2019
2019.08.10 09:15:20 LOG5[ui]: Threading:WIN32 Sockets:SELECT,IPv6 TLS:ENGINE,OCSP,PSK,SNI
2019.08.10 09:15:20 LOG5[ui]: Reading configuration from file C:/Buildbot/curl_winssl_msys2_mingw32_dbg/build/build-1440/tests/https_stunnel.conf
2019.08.10 09:15:20 LOG5[ui]: UTF-8 byte order mark not detected
2019.08.10 09:15:20 LOG5[ui]: Configuration successful
2019.08.10 09:15:20 LOG5[0]: Service [curltest] accepted connection from 127.0.0.1:62062
=== End of file https_stunnel.log
=== Start of file https_verify.log
* STATE: INIT => CONNECT handle 0x16a2df0; line 1362 (connection #-5000)
* Added connection 0. The cache now contains 1 members
* Trying 127.0.0.1:8991...
* TCP_NODELAY set
* STATE: CONNECT => WAITCONNECT handle 0x16a2df0; line 1418 (connection #0)
* Connected to 127.0.0.1 (127.0.0.1) port 8991 (#0)
* STATE: WAITCONNECT => SENDPROTOCONNECT handle 0x16a2df0; line 1536 (connection #0)
* Marked for [keep alive]: HTTP default
* ALPN, offering http/1.1
} [5 bytes data]
* TLSv1.3 (OUT), TLS handshake, Client hello (1):
} [512 bytes data]
* STATE: SENDPROTOCONNECT => PROTOCONNECT handle 0x16a2df0; line 1553 (connection #0)
* Operation timed out after 13008 milliseconds with 0 out of 0 bytes received
* multi_done
* Closing connection 0
* The cache now contains 0 members
* Expire cleared (transfer 0x16a2df0)
=== End of file https_verify.log
test 0300 SKIPPED: failed starting HTTPS server (stunnel)
RUN: server/sws --pidfile ".http_server.pid" --logfile "log/http_server.log" --ipv4 --port 8990 --srcdir "/tests"
test 0301 SKIPPED: failed starting HTTPS server (stunnel)
test 0302 SKIPPED: failed starting HTTPS server (stunnel)
test 0307 SKIPPED: curl lacks OpenSSL support
test 0308 SKIPPED: curl lacks OpenSSL support
test 0314 SKIPPED: curl lacks brotli support
test 0315 SKIPPED: curl lacks brotli support
test 0316 SKIPPED: curl lacks brotli support
test 0317...[HTTP with custom Authorization: and redirect to new host]
--pd---e--- OK (317 out of 1250, remaining: 12:02, took 0.3s, duration: 04:05)
test 0318...[HTTP with custom Authorization: and redirect to new host]
--pd---e--- OK (318 out of 1250, remaining: 12:00, took 0.3s, duration: 04:05)
test 0319...[HTTP GET gzip transfer-encoded data in raw mode]
--pd---e--- OK (319 out of 1250, remaining: 11:57, took 0.1s, duration: 04:05)
test 0320 SKIPPED: no gnutls-serv
test 0321 SKIPPED: no gnutls-serv
test 0322 SKIPPED: no gnutls-serv
test 0326...[HTTP GET chunked data in raw mode]
--pd---e--- OK (326 out of 1250, remaining: 11:37, took 0.1s, duration: 04:06)
test 0327...[HTTP with cookiejar without cookies left]
--pd--oe--- OK (327 out of 1250, remaining: 11:35, took 0.2s, duration: 04:06)
test 0328...[HTTP with "Content-Encoding: none]
--pd---e--- OK (328 out of 1250, remaining: 11:32, took 0.1s, duration: 04:06)
test 0329...[HTTP cookie with Max-Age=0]
--pd---e--- OK (329 out of 1250, remaining: 11:30, took 0.1s, duration: 04:06)
test 0330...[HTTP with custom Cookie: and redirect to new host]
--pd---e--- OK (330 out of 1250, remaining: 11:28, took 0.3s, duration: 04:06)
test 0331...[HTTP with cookie using host name 'moo']
--pd---e--- OK (331 out of 1250, remaining: 11:26, took 0.2s, duration: 04:07)
test 0332...[TFTP retrieve with blksize 400]
--pd---e--- OK (332 out of 1250, remaining: 11:23, took 0.1s, duration: 04:07)
test 0333...[Try a non-boolean command line option with --no-]
-------e--- OK (333 out of 1250, remaining: 11:21, took 0.1s, duration: 04:07)
test 0334...[HTTP 204 No content with chunked header]
--pd---e--- OK (334 out of 1250, remaining: 11:18, took 0.1s, duration: 04:07)
test 0340...[FTP using %00 in path with singlecwd]
OUT: 220- _ _ ____ _
220- ___| | | | _ \| |
220- / __| | | | |_) | |
220- | (__| |_| | _ {| |___
220 \___|\___/|_| \_\_____|
IN: USER anonymous
IN: PASS ftp@example.com
IN: PWD
--p----e--- OK (335 out of 1250, remaining: 11:16, took 0.1s, duration: 04:07)
test 0350...[FTP root dir list multicwd]
OUT: 220- _ _ ____ _
220- ___| | | | _ \| |
220- / __| | | | |_) | |
220- | (__| |_| | _ {| |___
220 \___|\___/|_| \_\_____|
IN: USER anonymous
IN: PASS ftp@example.com
IN: PWD
IN: CWD /
IN: EPSV
./server/sockfilt --ipv4 --port 0 --pidfile "./.ftp_sockdata.pid" --logfile "./log/ftp_sockdata.log"
IN: TYPE A
IN: LIST
IN: QUIT
--pd---e--- OK (336 out of 1250, remaining: 11:14, took 0.3s, duration: 04:07)
test 0351...[FTP root dir list nocwd]
OUT: 220- _ _ ____ _
220- ___| | | | _ \| |
220- / __| | | | |_) | |
220- | (__| |_| | _ {| |___
220 \___|\___/|_| \_\_____|
IN: USER anonymous
IN: PASS ftp@example.com
IN: PWD
IN: EPSV
./server/sockfilt --ipv4 --port 0 --pidfile "./.ftp_sockdata.pid" --logfile "./log/ftp_sockdata.log"
IN: TYPE A
IN: LIST /
IN: QUIT
--pd---e--- OK (337 out of 1250, remaining: 11:12, took 0.3s, duration: 04:08)
test 0352...[FTP root dir list singlecwd]
OUT: 220- _ _ ____ _
220- ___| | | | _ \| |
220- / __| | | | |_) | |
220- | (__| |_| | _ {| |___
220 \___|\___/|_| \_\_____|
IN: USER anonymous
IN: PASS ftp@example.com
IN: PWD
IN: CWD /
IN: EPSV
./server/sockfilt --ipv4 --port 0 --pidfile "./.ftp_sockdata.pid" --logfile "./log/ftp_sockdata.log"
IN: TYPE A
IN: LIST
IN: QUIT
--pd---e--- OK (338 out of 1250, remaining: 11:10, took 0.3s, duration: 04:08)
test 0353...[FTP home dir list singlecwd]
OUT: 220- _ _ ____ _
220- ___| | | | _ \| |
220- / __| | | | |_) | |
220- | (__| |_| | _ {| |___
220 \___|\___/|_| \_\_____|
IN: USER anonymous
IN: PASS ftp@example.com
IN: PWD
IN: EPSV
./server/sockfilt --ipv4 --port 0 --pidfile "./.ftp_sockdata.pid" --logfile "./log/ftp_sockdata.log"
IN: TYPE A
IN: LIST
IN: QUIT
--pd---e--- OK (339 out of 1250, remaining: 11:08, took 0.3s, duration: 04:08)
test 0354...[FTP without password]
OUT: 220- _ _ ____ _
220- ___| | | | _ \| |
220- / __| | | | |_) | |
220- | (__| |_| | _ {| |___
220 \___|\___/|_| \_\_____|
IN: USER anonymous
IN: PWD
IN: EPSV
./server/sockfilt --ipv4 --port 0 --pidfile "./.ftp_sockdata.pid" --logfile "./log/ftp_sockdata.log"
IN: TYPE I
IN: SIZE 354
IN: RETR 354
IN: QUIT
--pd---e--- OK (340 out of 1250, remaining: 11:06, took 0.3s, duration: 04:08)
test 0355 SKIPPED: curl lacks alt-svc support
test 0356 SKIPPED: curl lacks alt-svc support
test 0393...[HTTP max-filesize and out-of-range Content-Length]
--p----e--- OK (343 out of 1250, remaining: 10:58, took 0.2s, duration: 04:09)
test 0394...[HTTP with rubbish in Content-Length]
--p----e--- OK (344 out of 1250, remaining: 10:56, took 0.2s, duration: 04:09)
test 0395...[HTTP and out-of-range Content-Length]
--p----e--- OK (345 out of 1250, remaining: 10:54, took 0.2s, duration: 04:09)
Inter result: "/build-1440/tests"
Inter result: "/tests/stunnel.pem"
FTPS server (stunnel 5.54)
cmd: "/c/Program Files (x86)/stunnel/bin/tstunnel" /build-1440/tests/ftps_stunnel.conf >/build-1440/tests/log/ftps_stunnel.log 2>&1
CApath = C:/Buildbot/curl_winssl_msys2_mingw32_dbg/build/build-1440/tests
cert = C:/Buildbot/curl_winssl_msys2_mingw32_dbg/build/tests/stunnel.pem
debug = 5
socket = a:SO_REUSEADDR=1
socket = a:SO_EXCLUSIVEADDRUSE=0

[curltest]
accept = 8993
connect = 8992
OUT: 220- _ _ ____ _
220- ___| | | | _ \| |
220- / __| | | | |_) | |
220- | (__| |_| | _ {| |___
220 \___|\___/|_| \_\_____|
RUN: FTPS server failed verification
== Contents of files in the log/ dir after test 400
=== Start of file ftp_server.log
00:20:27.084133 ====> Client connect
00:20:27.086086 > "220- _ _ ____ _ [CR][LF]220- ___| | | | _ \| | [CR][LF]220- / __| | | | |_) | | [CR][LF]220- | (__| |_| | _ {| |___ [CR][LF]220 \___|\___/|_| \_\_____|[CR][LF]"
00:23:47.148510 Failed to read input
00:23:47.149483 Error: FTP server, read zero
goto problem 21
00:23:47.149709 Exited from sysread_or_die() at /tests/ftpserver.pl line 3054. FTP server, read zero
=== End of file ftp_server.log
=== Start of file ftp_sockctrl.log
09:20:27.421000 select_ws: 276 is readable
09:20:27.453000 ====> Client connect
09:20:27.562000 select_ws: 0 is readable
09:20:27.562000 Received DATA (on stdin)
09:20:27.562000 > 160 bytes data, server => client
09:20:27.562000 '220- _ _ ____ _ \r\n220- ___| | | | _ \| | '
09:20:27.562000 ' \r\n220- / __| | | | |_) | | \r\n220- | (__| |_| | '
09:20:27.562000 '_ {| |___ \r\n220 \___|\___/|_| \_\_____|\r\n'
=== End of file ftp_sockctrl.log
=== Start of file ftps_stunnel.log
2019.08.10 09:16:08 LOG5[ui]: stunnel 5.54 on x64-pc-mingw32-gnu platform
2019.08.10 09:16:08 LOG5[ui]: Compiled/running with OpenSSL 1.1.1b 26 Feb 2019
2019.08.10 09:16:08 LOG5[ui]: Threading:WIN32 Sockets:SELECT,IPv6 TLS:ENGINE,OCSP,PSK,SNI
2019.08.10 09:16:08 LOG5[ui]: Reading configuration from file C:/Buildbot/curl_winssl_msys2_mingw32_dbg/build/build-1440/tests/ftps_stunnel.conf
2019.08.10 09:16:08 LOG5[ui]: UTF-8 byte order mark not detected
2019.08.10 09:16:08 LOG5[ui]: Configuration successful
2019.08.10 09:16:09 LOG5[0]: Service [curltest] accepted connection from 127.0.0.1:62107
2019.08.10 09:16:23 LOG5[1]: Service [curltest] accepted connection from 127.0.0.1:62108
2019.08.10 09:16:37 LOG5[2]: Service [curltest] accepted connection from 127.0.0.1:62111
2019.08.10 09:16:51 LOG5[3]: Service [curltest] accepted connection from 127.0.0.1:62112
2019.08.10 09:17:11 LOG5[4]: Service [curltest] accepted connection from 127.0.0.1:62113
2019.08.10 09:17:25 LOG5[5]: Service [curltest] accepted connection from 127.0.0.1:62116
2019.08.10 09:17:39 LOG5[6]: Service [curltest] accepted connection from 127.0.0.1:62117
2019.08.10 09:17:54 LOG5[7]: Service [curltest] accepted connection from 127.0.0.1:62120
2019.08.10 09:18:08 LOG5[8]: Service [curltest] accepted connection from 127.0.0.1:62121
2019.08.10 09:18:22 LOG5[9]: Service [curltest] accepted connection from 127.0.0.1:62122
2019.08.10 09:18:36 LOG5[10]: Service [curltest] accepted connection from 127.0.0.1:62125
2019.08.10 09:18:50 LOG5[11]: Service [curltest] accepted connection from 127.0.0.1:62126
2019.08.10 09:19:10 LOG5[12]: Service [curltest] accepted connection from 127.0.0.1:62127
2019.08.10 09:19:24 LOG5[13]: Service [curltest] accepted connection from 127.0.0.1:62130
2019.08.10 09:19:38 LOG5[14]: Service [curltest] accepted connection from 127.0.0.1:62131
2019.08.10 09:19:52 LOG5[15]: Service [curltest] accepted connection from 127.0.0.1:62134
2019.08.10 09:20:07 LOG5[16]: Service [curltest] accepted connection from 127.0.0.1:62135
2019.08.10 09:20:27 LOG5[17]: Service [curltest] accepted connection from 127.0.0.1:62136
2019.08.10 09:20:40 LOG5[18]: Service [curltest] accepted connection from 127.0.0.1:62140
2019.08.10 09:20:54 LOG5[19]: Service [curltest] accepted connection from 127.0.0.1:62141
2019.08.10 09:21:09 LOG5[20]: Service [curltest] accepted connection from 127.0.0.1:62144
2019.08.10 09:21:23 LOG5[21]: Service [curltest] accepted connection from 127.0.0.1:62145
2019.08.10 09:21:38 LOG5[22]: Service [curltest] accepted connection from 127.0.0.1:62146
2019.08.10 09:21:52 LOG5[23]: Service [curltest] accepted connection from 127.0.0.1:62149
2019.08.10 09:22:06 LOG5[24]: Service [curltest] accepted connection from 127.0.0.1:62150
2019.08.10 09:22:26 LOG5[25]: Service [curltest] accepted connection from 127.0.0.1:62151
2019.08.10 09:22:40 LOG5[26]: Service [curltest] accepted connection from 127.0.0.1:62154
2019.08.10 09:22:54 LOG5[27]: Service [curltest] accepted connection from 127.0.0.1:62155
2019.08.10 09:23:09 LOG5[28]: Service [curltest] accepted connection from 127.0.0.1:62158
2019.08.10 09:23:23 LOG5[29]: Service [curltest] accepted connection from 127.0.0.1:62160
=== End of file ftps_stunnel.log
=== Start of file ftps_verify.log
* STATE: INIT => CONNECT handle 0x1ab2d68; line 1362 (connection #-5000)
* Added connection 0. The cache now contains 1 members
* Trying 127.0.0.1:8993...
* TCP_NODELAY set
* STATE: CONNECT => WAITCONNECT handle 0x1ab2d68; line 1418 (connection #0)
* Connected to 127.0.0.1 (127.0.0.1) port 8993 (#0)
* STATE: WAITCONNECT => SENDPROTOCONNECT handle 0x1ab2d68; line 1536 (connection #0)
* Marked for [keep alive]: FTP default
} [5 bytes data]
* TLSv1.3 (OUT), TLS handshake, Client hello (1):
} [512 bytes data]
* SSL connection timeout
* multi_done
* Marked for [closure]: FTP ended with bad error code
* Closing connection 0
* The cache now contains 0 members
* Expire cleared (transfer 0x1ab2d68)
=== End of file ftps_verify.log
test 0400 SKIPPED: failed starting FTPS server (stunnel)
./server/sockfilt --ipv4 --port 8992 --pidfile "./.ftp_sockctrl.pid" --logfile "./log/ftp_sockctrl.log"
OUT: 220- _ _ ____ _
220- ___| | | | _ \| |
220- / __| | | | |_) | |
220- | (__| |_| | _ {| |___
220 \___|\___/|_| \_\_____|
IN: USER anonymous
IN: PASS ftp@example.com
IN: PWD
IN: EPSV
./server/sockfilt --ipv4 --port 0 --pidfile "./.ftp_sockdata.pid" --logfile "./log/ftp_sockdata.log"
IN: TYPE I
IN: SIZE verifiedserver
IN: RETR verifiedserver
FTPD: We returned proof we are the test server
IN: QUIT
test 0401 SKIPPED: failed starting FTPS server (stunnel)
test 0402...[FTP SSL required on non-SSL server]
OUT: 220- _ _ ____ _
220- ___| | | | _ \| |
220- / __| | | | |_) | |
220- | (__| |_| | _ {| |___
220 \___|\___/|_| \_\_____|
IN: AUTH SSL
IN: AUTH TLS
--p----e--- OK (348 out of 1250, remaining: 30:59, took 0.1s, duration: 11:57)
test 0403 SKIPPED: failed starting FTPS server (stunnel)
test 0405...[FTPS operation to FTP port]
OUT: 220- _ _ ____ _
220- ___| | | | _ \| |
220- / __| | | | |_) | |
220- | (__| |_| | _ {| |___
220 \___|\___/|_| \_\_____|
-------e--- OK (351 out of 1250, remaining: 30:38, took 0.1s, duration: 11:57)
test 0500...[simple libcurl HTTP GET tool]
--pd--oe--- OK (356 out of 1250, remaining: 30:02, took 0.1s, duration: 11:57)
test 0501...[simple libcurl attempt operation without URL set]
-------e--- OK (357 out of 1250, remaining: 29:55, took 0.1s, duration: 11:57)
test 0502...[simple multi file:// get]
---d---e--- OK (358 out of 1250, remaining: 29:48, took 0.1s, duration: 11:57)
test 0503...[simple multi http:// through proxytunnel with authentication info]
--pd-P-e--- OK (359 out of 1250, remaining: 29:43, took 0.7s, duration: 11:58)
test 0504...[simple multi through local proxy without listener]
-------e--- OK (360 out of 1250, remaining: 29:41, took 2.1s, duration: 12:00)
test 0505...[FTP upload with rename after transfer]
OUT: 220- _ _ ____ _
220- ___| | | | _ \| |
220- / __| | | | |_) | |
220- | (__| |_| | _ {| |___
220 \___|\___/|_| \_\_____|
IN: USER anonymous
IN: PASS ftp@example.com
IN: PWD
IN: EPSV
./server/sockfilt --ipv4 --port 0 --pidfile "./.ftp_sockdata.pid" --logfile "./log/ftp_sockdata.log"
IN: TYPE I
IN: STOR 505
IN: RNFR 505
IN: RNTO 505-forreal
IN: QUIT
--p-u--e--- OK (361 out of 1250, remaining: 29:35, took 0.3s, duration: 12:01)
test 0506 SKIPPED: curl has threaded-resolver support
test 0507...[multi interface get with non-existing host name]
-------e--- OK (363 out of 1250, remaining: 29:24, took 1.1s, duration: 12:02)
test 0508...[send HTTP POST using read callback]
--pd---e--- OK (364 out of 1250, remaining: 29:18, took 0.2s, duration: 12:02)
test 0509...[initialization with memory callbacks and actual usage]
s------e--- OK (365 out of 1250, remaining: 29:11, took 0.1s, duration: 12:02)
test 0510...[send HTTP POST using read callback, using chunked transfer-encoding]
--pd---e--- OK (366 out of 1250, remaining: 29:07, took 1.2s, duration: 12:03)
test 0511...[FTP with FILETIME and NOBODY but missing file]
OUT: 220- _ _ ____ _
220- ___| | | | _ \| |
220- / __| | | | |_) | |
220- | (__| |_| | _ {| |___
220 \___|\___/|_| \_\_____|
IN: USER anonymous
IN: PASS ftp@example.com
IN: PWD
IN: MDTM 511
IN: QUIT
--p----e--- OK (367 out of 1250, remaining: 29:01, took 0.1s, duration: 12:03)
test 0512...[simple curl_easy_duplicate() test]
--pd---e--- OK (368 out of 1250, remaining: 28:55, took 0.2s, duration: 12:04)
test 0513...[send HTTP POST using read callback that returns CURL_READFUNC_ABORT]
--p----e--- OK (369 out of 1250, remaining: 28:51, took 1.1s, duration: 12:05)
test 0514...[First set options to POST and then to make HEAD]
--pd---e--- OK (370 out of 1250, remaining: 28:47, took 1.1s, duration: 12:06)
test 0515...[make a POSTFIELDS set to NULL with POSTFIELDSIZE set to zero]
--pd---e--- OK (371 out of 1250, remaining: 28:41, took 0.2s, duration: 12:06)
test 0516...[make a HTTPPOST set to NULL]
--pd---e--- OK (372 out of 1250, remaining: 28:35, took 0.2s, duration: 12:06)
test 0517...[curl_getdate() testing]
-------e--- OK (373 out of 1250, remaining: 28:28, took 0.1s, duration: 12:06)
test 0518 SKIPPED: curl lacks getrlimit support
test 0519...[GET same URL twice with different users]
--pd---e--- OK (375 out of 1250, remaining: 28:16, took 0.2s, duration: 12:06)
test 0520...[FTP RETR with FILETIME]
OUT: 220- _ _ ____ _
220- ___| | | | _ \| |
220- / __| | | | |_) | |
220- | (__| |_| | _ {| |___
220 \___|\___/|_| \_\_____|
IN: USER anonymous
IN: PASS ftp@example.com
IN: PWD
IN: MDTM 520
IN: EPSV
./server/sockfilt --ipv4 --port 0 --pidfile "./.ftp_sockdata.pid" --logfile "./log/ftp_sockdata.log"
IN: TYPE I
IN: SIZE 520
/usr/bin/sh: line 1: 1440 Killed "./tests/testcurl.pl" "--target=mingw" "--nogitpull" "--configure=--build=i686-w64-mingw32 --host=i686-w64-mingw32 --with-winssl --with-winidn --with-libssh2=/tmp/curl_winssl_msys2_mingw32_dbg/libssh2 --enable-sspi --enable-ipv6 --enable-debug --enable-warnings" "--mktarball=../mktarball.sh" "--name=Marc" "--email=info/at/marc-hoersken/dot/de" "--desc=Win32 target on Windows Server 2016 Datacenter, version 1803 (64-bit) - i686-w64-mingw32 - gcc-9.1.0 (Msys2)" "--runtestopts=-d -a -p -r"


INPIPE: endsingle here

Download build log